{"text_format":"1","workbook":"xlsx","n_sheets":3,"sheets":["All Products","Sheet2","Sheet1"],"not_rendered":{"charts":0,"images":9,"macros":1,"external_links":0,"defined_names":3,"comments":0,"pivot_tables":0},"unopened":[],"bounds":{"document_bytes":16777216,"sheet_cells":100000,"rows_first":2000,"rows_last":500,"rows_between":2000,"halvings":0,"cell_chars":16384,"cell_head_chars":4096},"cells_cut":0,"cells_raw":0,"read":"whole","date_system":"1900"}

{"sheet":"All Products","index":0,"n_rows":166,"n_cols":142,"rows_kept":166,"cut":false,"hidden":false,"merged":[[62,17,62,18],[62,19,62,22],[63,2,64,9],[63,10,64,10],[63,11,64,14],[63,15,64,16],[63,17,64,18],[63,19,64,22],[114,20,114,23],[114,1,114,9],[114,13,114,15],[114,16,114,19],[111,10,111,12],[108,1,108,9],[70,11,71,14],[118,29,118,33],[101,29,101,33],[98,29,98,33],[108,29,108,33],[107,29,107,33],[105,29,105,33],[99,29,99,33],[100,34,100,40],[101,34,101,40],[88,28,88,40],[97,24,97,28],[95,24,95,28],[96,24,96,28],[92,29,92,33],[93,29,93,33],[94,34,94,40],[93,34,93,40],[99,41,99,46],[95,41,95,46],[44,30,44,53],[42,46,42,47],[39,52,40,53],[39,42,40,45],[48,2,48,9],[39,30,40,38],[38,15,38,16],[51,30,51,38],[51,39,51,41],[51,42,51,45],[50,39,50,41],[38,11,38,14],[46,23,46,24],[40,2,40,24],[39,2,39,24],[46,17,46,18],[46,2,46,9],[41,2,42,24],[47,11,47,14],[48,11,48,14],[49,23,49,24],[48,42,49,45],[47,30,47,53],[44,17,45,22],[12,30,13,53],[124,34,124,40],[119,41,119,46],[116,34,116,40],[118,34,118,40],[116,41,116,46],[108,34,108,40],[109,34,109,40],[110,34,110,40],[115,34,115,40],[115,41,115,46],[120,34,120,40],[121,34,121,40],[122,34,122,40],[123,34,123,40],[117,41,117,46],[118,41,118,46],[50,42,50,45],[50,46,50,47],[50,50,50,51],[58,48,59,51],[60,30,60,38],[104,47,104,50],[94,41,94,46],[19,42,19,45],[19,30,19,38],[51,50,51,51],[51,52,51,53],[53,30,53,53],[48,48,49,51],[111,41,111,46],[104,41,104,46],[105,41,105,46],[106,41,106,46],[107,41,107,46],[109,47,109,50],[109,41,109,46],[111,34,111,40],[110,47,110,50],[108,47,108,50],[108,41,108,46],[111,47,111,50],[106,34,106,40],[105,34,105,40],[104,34,104,40],[48,46,49,47],[51,46,51,47],[42,42,42,45],[94,47,94,50],[95,47,95,50],[98,47,98,50],[101,41,101,46],[100,41,100,46],[99,47,99,50],[0,72,3,77],[48,39,49,41],[43,30,43,53],[79,41,79,42],[80,41,80,42],[80,47,80,50],[11,30,11,53],[19,63,20,63],[19,60,20,62],[30,46,30,47],[31,46,31,47],[30,48,30,49],[31,48,31,49],[28,42,29,45],[30,50,30,51],[61,52,61,53],[42,48,42,49],[14,30,16,53],[60,46,60,47],[60,52,60,53],[70,50,70,51],[71,48,71,49],[71,42,71,45],[61,46,61,47],[109,101,110,103],[111,101,112,101],[87,47,87,50],[111,102,112,102],[111,103,112,103],[105,47,105,50],[96,47,96,50],[96,41,96,46],[97,41,97,46],[97,47,97,50],[89,48,89,50],[101,47,101,50],[107,47,107,50],[106,47,106,50],[102,47,102,50],[87,43,87,46],[88,43,88,46],[100,47,100,50],[95,34,95,40],[96,34,96,40],[97,34,97,40],[103,34,103,40],[98,41,98,46],[102,41,102,46],[103,47,103,50],[103,41,103,46],[99,34,99,40],[102,34,102,40],[98,34,98,40],[91,47,91,50],[92,47,92,50],[93,47,93,50],[60,50,60,51],[72,30,72,53],[92,41,92,46],[77,41,77,42],[61,42,61,45],[70,42,70,45],[70,48,70,49],[78,41,78,42],[79,47,79,50],[82,47,82,50],[91,41,91,46],[84,43,84,46],[85,43,85,46],[88,41,88,42],[87,41,87,42],[86,43,86,46],[71,39,71,41],[61,48,61,49],[93,41,93,46],[61,30,61,38],[81,43,81,46],[114,41,114,46],[114,24,114,28],[110,24,110,28],[110,20,110,23],[111,13,111,15],[115,20,115,23],[115,29,115,33],[115,24,115,28],[116,29,116,33],[114,29,114,33],[111,20,111,23],[114,34,114,40],[113,1,113,50],[111,29,111,33],[110,41,110,46],[111,1,111,9],[110,1,110,9],[115,13,115,15],[115,1,115,9],[116,1,116,9],[70,46,70,47],[62,30,62,53],[58,39,59,41],[60,42,60,45],[61,23,61,24],[62,23,62,24],[61,17,61,18],[70,39,70,41],[81,47,81,50],[60,19,60,22],[61,39,61,41],[64,30,65,53],[71,46,71,47],[66,30,67,53],[61,50,61,51],[60,48,60,49],[58,46,59,47],[58,42,59,45],[77,47,77,50],[73,23,73,24],[75,2,75,24],[77,28,77,40],[76,2,76,24],[73,15,73,16],[37,17,37,18],[37,11,37,14],[38,23,38,24],[47,23,47,24],[46,19,46,22],[36,2,36,9],[33,2,34,9],[33,10,34,10],[47,19,47,22],[44,10,45,10],[44,2,45,9],[46,15,46,16],[47,17,47,18],[38,17,38,18],[47,2,47,9],[44,23,45,24],[44,11,45,14],[37,2,37,9],[38,2,38,9],[44,15,45,16],[37,19,37,22],[37,23,37,24],[35,11,35,14],[43,2,43,24],[17,48,17,51],[20,42,20,45],[28,48,29,51],[28,39,29,41],[26,30,27,53],[24,30,25,53],[19,50,19,51],[20,50,20,51],[19,48,19,49],[20,48,20,49],[21,30,21,53],[18,46,18,47],[19,52,19,53],[20,52,20,53],[17,39,17,41],[18,39,18,41],[18,52,18,53],[19,39,19,41],[20,39,20,41],[20,46,20,47],[19,46,19,47],[17,46,17,47],[18,50,18,51],[18,48,18,49],[142,17,142,21],[144,37,145,43],[135,7,136,10],[135,11,136,12],[137,11,137,12],[145,25,145,33],[138,31,138,37],[112,1,112,9],[112,16,112,19],[122,1,122,9],[123,1,123,9],[121,1,121,9],[112,10,112,12],[117,13,117,15],[118,13,118,15],[118,10,118,12],[119,20,119,23],[120,20,120,23],[124,20,124,23],[122,29,122,33],[123,29,123,33],[122,24,122,28],[124,24,124,28],[123,24,123,28],[146,45,146,50],[151,19,151,20],[135,17,136,21],[122,13,122,15],[26,2,26,24],[29,2,30,24],[146,13,146,14],[142,1,142,6],[131,2,132,20],[146,37,146,43],[133,1,134,20],[135,1,136,6],[140,11,140,12],[137,7,137,10],[139,7,139,10],[140,7,140,10],[138,11,138,12],[138,13,138,16],[138,17,138,21],[139,17,139,21],[137,17,137,21],[138,1,138,6],[135,13,136,16],[132,29,132,50],[128,44,128,50],[140,17,140,21],[141,17,141,21],[138,7,138,10],[141,1,141,6],[137,1,137,6],[125,29,125,33],[125,34,125,40],[126,36,126,40],[126,48,126,50],[140,13,140,16],[140,1,140,6],[139,13,139,16],[139,11,139,12],[137,13,137,16],[125,24,125,28],[125,20,125,23],[125,41,125,46],[125,47,125,50],[125,16,125,19],[125,1,125,9],[125,13,125,15],[125,10,125,12],[111,129,112,140],[112,47,112,50],[113,137,116,137],[113,138,116,138],[113,139,116,139],[113,140,116,140],[114,47,114,50],[113,136,116,136],[112,117,114,117],[113,129,116,129],[113,132,116,132],[113,133,116,133],[113,130,116,130],[113,131,116,131],[115,47,115,50],[116,47,116,50],[113,134,116,134],[112,123,114,123],[111,104,112,104],[112,118,114,118],[112,116,114,116],[112,119,114,119],[112,120,114,120],[113,135,116,135],[123,41,123,46],[124,41,124,46],[119,34,119,40],[119,47,119,50],[120,47,120,50],[123,47,123,50],[124,29,124,33],[124,47,124,50],[122,47,122,50],[120,41,120,46],[125,123,126,123],[125,117,126,117],[125,118,126,118],[125,119,126,119],[125,120,126,120],[125,121,126,121],[125,116,126,116],[125,122,126,122],[126,34,126,35],[117,34,117,40],[122,20,122,23],[122,16,122,19],[118,47,118,50],[112,121,114,121],[112,41,112,46],[117,47,117,50],[119,29,119,33],[120,29,120,33],[112,29,112,33],[117,29,117,33],[121,20,121,23],[121,16,121,19],[121,24,121,28],[119,24,119,28],[120,24,120,28],[116,24,116,28],[117,24,117,28],[118,24,118,28],[121,47,121,50],[121,29,121,33],[121,41,121,46],[122,41,122,46],[112,34,112,40],[107,34,107,40],[114,10,114,12],[107,20,107,23],[107,10,107,12],[111,24,111,28],[109,24,109,28],[112,13,112,15],[112,20,112,23],[109,29,109,33],[110,29,110,33],[112,24,112,28],[108,24,108,28],[107,24,107,28],[106,16,106,19],[106,20,106,23],[105,16,105,19],[104,20,104,23],[104,16,104,19],[94,29,94,33],[95,20,95,23],[95,16,95,19],[100,24,100,28],[100,29,100,33],[101,24,101,28],[103,24,103,28],[102,24,102,28],[99,24,99,28],[95,29,95,33],[96,20,96,23],[97,20,97,23],[104,10,104,12],[100,20,100,23],[106,24,106,28],[96,29,96,33],[97,29,97,33],[104,24,104,28],[105,24,105,28],[77,43,77,46],[84,41,84,42],[85,41,85,42],[80,43,80,46],[83,28,83,40],[82,43,82,46],[84,47,84,50],[83,43,83,46],[78,47,78,50],[86,47,86,50],[83,47,83,50],[78,43,78,46],[79,43,79,46],[82,41,82,42],[85,47,85,50],[83,41,83,42],[81,41,81,42],[149,15,149,22],[103,16,103,19],[123,20,123,23],[123,13,123,15],[124,13,124,15],[120,13,120,15],[97,16,97,19],[96,16,96,19],[146,25,146,33],[102,29,102,33],[102,20,102,23],[103,20,103,23],[103,29,103,33],[106,29,106,33],[104,29,104,33],[104,13,104,15],[118,20,118,23],[116,16,116,19],[117,16,117,19],[118,16,118,19],[116,20,116,23],[117,20,117,23],[115,16,115,19],[102,16,102,19],[99,10,99,12],[99,16,99,19],[101,20,101,23],[106,13,106,15],[102,10,102,12],[103,10,103,12],[105,20,105,23],[106,10,106,12],[102,13,102,15],[108,20,108,23],[108,10,108,12],[109,10,109,12],[109,16,109,19],[107,13,107,15],[108,13,108,15],[115,10,115,12],[101,1,101,9],[110,13,110,15],[109,13,109,15],[101,16,101,19],[111,16,111,19],[110,16,110,19],[117,10,117,12],[98,10,98,12],[101,13,101,15],[100,16,100,19],[106,1,106,9],[103,1,103,9],[100,1,100,9],[109,1,109,9],[116,10,116,12],[117,1,117,9],[122,10,122,12],[123,10,123,12],[107,16,107,19],[108,16,108,19],[107,1,107,9],[102,1,102,9],[105,13,105,15],[104,1,104,9],[105,1,105,9],[119,10,119,12],[120,10,120,12],[121,10,121,12],[116,13,116,15],[121,13,121,15],[118,1,118,9],[120,1,120,9],[119,1,119,9],[120,16,120,19],[119,13,119,15],[119,16,119,19],[124,1,124,9],[60,23,60,24],[70,30,70,38],[71,30,71,38],[78,28,78,40],[79,28,79,40],[101,10,101,12],[96,13,96,15],[97,13,97,15],[98,13,98,15],[99,13,99,15],[100,13,100,15],[70,17,71,22],[72,17,72,18],[92,16,92,19],[93,10,93,12],[94,10,94,12],[99,20,99,23],[95,10,95,12],[96,10,96,12],[97,10,97,12],[124,10,124,12],[123,16,123,19],[124,16,124,19],[94,1,94,9],[93,13,93,15],[95,1,95,9],[100,10,100,12],[98,16,98,19],[98,24,98,28],[86,28,86,40],[91,34,91,40],[82,28,82,40],[95,13,95,15],[93,1,93,9],[91,10,91,12],[89,20,89,33],[92,13,92,15],[91,13,91,15],[93,20,93,23],[91,16,91,19],[93,16,93,19],[92,10,92,12],[97,1,97,9],[98,1,98,9],[99,1,99,9],[98,20,98,23],[96,1,96,9],[70,10,71,10],[79,5,82,11],[67,2,68,24],[69,2,69,24],[92,24,92,28],[18,2,18,9],[21,2,21,9],[22,10,23,10],[22,11,23,14],[61,2,61,9],[62,2,62,9],[61,11,61,14],[72,2,72,9],[73,2,73,9],[84,28,84,40],[85,28,85,40],[81,28,81,40],[80,28,80,40],[87,28,87,40],[62,15,62,16],[66,2,66,24],[70,15,71,16],[72,23,72,24],[60,39,60,41],[18,19,18,22],[33,15,34,16],[18,17,18,18],[31,10,32,10],[20,2,20,9],[25,2,25,24],[20,23,20,24],[22,17,23,18],[22,23,23,24],[24,19,24,22],[19,15,19,16],[20,17,20,18],[31,17,32,22],[19,23,19,24],[22,2,23,9],[31,2,32,9],[68,42,69,45],[68,46,69,47],[68,48,69,51],[70,52,70,53],[71,52,71,53],[68,52,69,53],[71,50,71,51],[20,30,20,38],[20,19,20,22],[22,30,23,53],[30,42,30,45],[32,39,32,41],[32,46,32,47],[52,2,53,24],[54,2,55,24],[65,2,65,24],[56,2,57,9],[56,11,57,14],[58,15,58,16],[56,17,57,22],[61,15,61,16],[61,19,61,22],[70,2,71,9],[59,23,59,24],[73,19,73,22],[94,13,94,15],[94,16,94,19],[94,24,94,28],[93,24,93,28],[94,20,94,23],[62,11,62,14],[92,20,92,23],[92,34,92,40],[91,29,91,33],[91,20,91,23],[91,24,91,28],[68,30,69,38],[68,39,69,41],[73,17,73,18],[72,15,72,16],[72,19,72,22],[70,23,71,24],[72,11,72,14],[73,11,73,14],[86,41,86,42],[63,30,63,53],[63,23,64,24],[88,47,88,50],[8,2,8,53],[17,23,17,24],[18,23,18,24],[17,2,17,9],[36,15,36,16],[37,15,37,16],[33,23,34,24],[17,52,17,53],[17,30,17,38],[12,2,13,24],[21,15,21,16],[20,15,20,16],[19,2,19,9],[18,11,18,14],[19,11,19,14],[20,11,20,14],[14,2,16,24],[18,30,18,38],[24,15,24,16],[24,11,24,14],[31,15,32,16],[35,15,35,16],[17,11,17,14],[19,19,19,22],[17,15,17,16],[18,15,18,16],[17,17,17,22],[36,11,36,14],[24,17,24,18],[33,11,34,14],[31,11,32,14],[36,17,36,18],[35,23,35,24],[36,23,36,24],[35,17,35,18],[19,17,19,18],[21,23,21,24],[24,23,24,24],[21,11,21,14],[33,17,34,18],[35,19,35,22],[21,19,21,22],[21,17,21,18],[22,19,23,22],[27,2,28,24],[31,23,32,24],[22,15,23,16],[35,2,35,9],[28,30,29,38],[45,30,46,53],[28,46,29,47],[32,30,32,38],[42,30,42,38],[30,52,30,53],[39,46,40,47],[39,48,40,51],[39,39,40,41],[30,39,30,41],[28,52,29,53],[32,48,32,49],[32,50,32,51],[41,39,41,41],[42,50,42,51],[32,52,32,53],[42,39,42,41],[31,39,31,41],[42,52,42,53],[41,30,41,38],[41,52,41,53],[41,42,41,45],[41,46,41,47],[41,48,41,49],[58,52,59,53],[50,52,50,53],[55,30,56,53],[50,30,50,38],[58,19,58,22],[56,15,57,16],[47,15,47,16],[46,11,46,14],[59,15,59,16],[59,19,59,22],[58,17,58,18],[58,30,59,38],[48,52,49,53],[48,30,49,38],[51,48,51,49],[54,30,54,53],[57,30,57,53],[50,48,50,49],[56,10,57,10],[59,11,59,14],[48,17,48,18],[51,2,51,24],[50,2,50,24],[49,11,49,14],[49,17,49,18],[48,15,48,16],[49,19,49,22],[58,11,58,14],[49,15,49,16],[49,2,49,9],[48,19,48,22],[48,23,48,24],[36,19,36,22],[31,52,31,53],[31,50,31,51],[31,42,31,45],[33,19,34,22],[30,30,30,38],[31,30,31,38],[38,30,38,53],[38,19,38,22],[36,30,37,53],[32,42,32,45],[41,50,41,51],[165,36,165,50],[165,23,165,34],[165,7,165,21],[165,1,165,6],[158,1,164,50],[139,31,139,37],[137,29,137,41],[137,42,137,49],[133,29,136,50],[145,7,145,11],[148,14,148,23],[146,15,146,22],[146,23,146,24],[145,14,145,23],[146,34,146,36],[151,34,151,43],[153,1,157,50],[139,1,139,6],[141,7,142,16],[151,11,151,18],[146,7,146,12],[151,23,151,30],[151,1,151,10],[0,42,1,42],[0,41,1,41],[151,44,151,50],[149,45,149,50],[147,45,148,50],[109,20,109,23],[103,13,103,15],[105,10,105,12],[110,10,110,12],[7,4,7,42],[91,1,91,9],[92,1,92,9],[24,2,24,9],[17,42,17,45],[18,42,18,45],[58,23,58,24],[60,2,60,9],[59,17,59,18],[60,17,60,18],[60,15,60,16],[60,11,60,14],[58,2,58,9],[59,2,59,9],[56,23,57,24]]}
[null,null,null,null,null,null,null,null,null,null,null,null,null,null,null,null,null,null,null,null,null,null,null,null,null,null,null,null,null,null,null,null,null,null,null,null,null,null,null,null,null,null,null,null,null,null,null,null,null,null,null,null,null,null,null,null,null,null,null,null,null,null,"CALCULATE BASE AMOUNT",{"$f":"IF(CM129>0,CM129,\"\")","v":""},null,null,null,null,{"$f":"IF(TRIM(BL17)<>\"\",ROUND(BL17,0),\"\")","v":""},null,null,null,"The Bayer Season PAK is back, offering you the performance of complete insect and disease control you need to manage your golf course. Bayer Season PAK customers automatically receive a minimum 8% rebate on all purchases during the program (Includes October bonus).",null,null,null,null,null,null,null,null,null,null,null,null,null,null,null,null,null,"Oct Purchase",null,"Points or Credit"]
[null,null,null,null,null,null,null,null,null,null,null,null,null,null,null,null,null,null,null,null,null,null,null,null,null,null,null,null,null,null,null,null,null,null,null,null,null,null,null,null,null,null,null,null,null,null,null,null,null,null,null,null,null,null,null,null,null,null,null,null,null,null,null,null,{"$f":"IF(ISNA(VLOOKUP(Y92,$CD$1:$CD$1998,1,FALSE)),0,1)","v":0},null,null,null,{"$f":"IF(TRIM(BL17)<>\"\",IF(BQ1>=15000,\"*****  YOU ARE NOW QUALIFIED  *****\",\"\"),\"\")","v":""}]
[null,null,null,null,null,null,null,null,null,null,null,null,null,null,null,null,null,null,null,null,null,null,null,null,null,null,null,null,null,null,null,null,null,null,null,null,null,null,null,null,null,null,null,null,null,null,null,null,null,null,null,null,null,null,null,null,null,null,null,null,null,null,"CALCULATE BASE REBATE",{"$f":"IF(TRIM(BL1)<>\"\",IF((BL1)<2500,0,IF(AND((BL1)>=2500,(BL1)<10000),0.02,IF(AND((BL1)>=10000,(BL1)<15000),0.03,IF(AND((BL1)>=15000,(BL1)<25000),0.04,IF(AND((BL1)>=25000,(BL1)<28500),IF(TRIM(AP79)<>\"\",IF((AV79)>=1,0.08,0.05),0.05),IF(AND((BL1)>=28500,(BL1)<40000),0.08,IF((BL1)>=40000,0.09,\"\"))))))),\"\")","v":""},{"$f":"IF(ISNA(VLOOKUP(Y117,$CD$1:$CD$1998,1,FALSE)),0,1)","v":0},null,null,null,{"$f":"IF(TRIM(BL17)<>\"\",IF(BQ1>=15000,\"CLICK HERE TO LOG ON TO\",\"\"),\"\")","v":""},null,null,null,null,null,null,null,null,null,null,null,null,null,null,null,null,null,null,null,false,null,false,null,1]
[null,null,null,null,null,null,null,null,null,null,null,null,null,null,null,null,null,null,null,null,null,null,null,null,null,null,null,null,null,null,null,null,null,null,null,null,null,null,null,null,null,null,null,null,null,null,null,null,null,null,null,null,null,null,null,null,null,null,null,null,null,null,null,null,null,null,null,null,{"$f":"IF(BL17<=14999,\"\",HYPERLINK(\"http://www.bayergreenback.com\",\"BAYERGREENBACK.COM\"))","v":"BAYERGREENBACK.COM"}]
[null,null,null,null,null,null,null,null,null,null,null,null,null,null,null,null,null,null,null,null,null,null,null,null,null,null,null,null,null,null,null,null,null,null,null,null,null,null,null,null,null,null,null,null,null,null,null,null,null,null,null,null,null,null,null,null,null,null,null,null,null,null,"CALCULATE OCTOBER BONUS",{"$f":"IF((CM3)=TRUE,IF(TRIM(AV79)<>\"\",\"\",IF(BL1>=28500,\"\",IF(TRIM(BL1)<>\"\",0.01,\"\"))),\"\")","v":""},null,null,null,null,null,null,null,null,"Bayer Season PAK Note"]
[]
[]
[null,null,null,null,"Bayer PAKS offer solutions for your specific turf needs.",null,null,null,null,null,null,null,null,null,null,null,null,null,null,null,null,null,null,null,null,null,null,null,null,null,null,null,null,null,null,null,null,null,null,null,null,null,null,null,null,null,null,null,null,null,null,null,null,null,null,null,null,null,null,null,null,null,"CALCULATE PAK REBATE",{"$f":"IF(TRIM(AW90)<>\"\",IF(AND((TRIM(AP79)<>\"\"),(AV79)>=1),\"\",IF(BL1>=28500,\"\",0.01)),\"\")","v":""}]
[]
[]
[]
[]
[null,null,{"$f":"CONCATENATE(\"Bayer Season PAK\",IF(CH85=2,\" - NOT AVAIL.\",CONCATENATE(\" - $\",FIXED(AR79,2,FALSE))))","v":"Bayer Season PAK - $28,500.00"},null,null,null,null,null,null,null,null,null,null,null,null,null,null,null,null,null,null,null,null,null,null,null,null,null,null,null,{"$f":"CONCATENATE(\"Warm Season Herbicide PAK\",IF(OR(CH85=1,CH85=4),\" - NOT AVAIL.\",CONCATENATE(\" - $\",FIXED(AR84,2,FALSE))))","v":"Warm Season Herbicide PAK - $5,150.00"},null,null,null,null,null,null,null,null,null,null,null,null,null,null,null,null,null,null,null,null,null,null,null,null,null,null,null,null,null,null,null,null,{"$f":"IF(SUM(BL3:BL10)>=0,SUM(BL3:BL10),\"\")","v":0}]
[]
[null,null,{"$f":"IF(CH85=2,\"THIS PAK IS NOT AVAILABLE FOR CALIFORNIA CUSTOMERS.\",BU1)","v":"The Bayer Season PAK is back, offering you the performance of complete insect and disease control you need to manage your golf course. Bayer Season PAK customers automatically receive a minimum 8% rebate on all purchases during the program (Includes October bonus)."},null,null,null,null,null,null,null,null,null,null,null,null,null,null,null,null,null,null,null,null,null,null,null,null,null,null,null,{"$f":"IF(CH85=1,\"THIS PAK IS NOT AVAILABLE FOR WASHINGTON CUSTOMERS.\",IF(CH85=4,\"THIS PAK IS NOT AVAILABLE FOR NEW YORK CUSTOMERS.\",\"Provides a great combination of pre- and postemergent herbicide options to control a broad spectrum of difficult to control weeds.\"))","v":"Provides a great combination of pre- and postemergent herbicide options to control a broad spectrum of difficult to control weeds."}]
[]
[null,null,null,null,null,null,null,null,null,null,null,null,null,null,null,null,null,null,null,null,null,null,null,null,null,null,null,null,null,null,null,null,null,null,null,null,null,null,null,null,null,null,null,null,null,null,null,null,null,null,null,null,null,null,null,null,null,null,null,null,null,null,"TOTAL $",{"$f":"IF(SUM(AW90,AK127)>0,SUM(AW90,AK127),\"\")","v":""}]
[null,null,"PRODUCTS",null,null,null,null,null,null,null,"UNITS/\nPAK","UNIT SIZE",null,null,null,"GAL/LB\n/OZ",null,"USE RATE",null,null,null,null,null,"ACRES\nTREATED",null,null,null,null,null,null,"PRODUCTS",null,null,null,null,null,null,null,null,"UNITS/\nPAK",null,null,"UNIT SIZE",null,null,null,"GAL/LB\n/OZ",null,"USE RATE",null,null,null,"ACRES\nTREATED",null,null,null,null,null,null,null,null,null,"TOTAL PROGRAM REBATE %",{"$f":"IF(TRIM(BL17)<>\"\",IF(CM129>=2500,IF(TRIM(BL13)<>\"\",BL13,\"\"),\"\"),\"\")","v":""}]
[null,null,"Banol®",null,null,null,null,null,null,null,2,"  2 x 1 gal/case",null,null,null,4,null,2,null,"oz/1,000",null,null,null,{"$f":"IF(TRIM(R19)<>\"\",(P19*128)/(R19*43.56),\"\")","v":5.8769513314967856},null,null,null,null,null,null,"Specticle® FLO",null,null,null,null,null,null,null,null,1,null,null,"2 X 1 gal/case",null,null,null,2,null,6.5,null,"oz./acre",null,{"$f":"IF(TRIM(AW19)<>\"\",(AU19*128)/AW19,\"\")","v":39.384615384615387},null,null,null,null,null,null,null,null,null,"TOTAL PROGRAM REBATE",{"$f":"IF(TRIM(BL1)=\"\",\"\",IF((BL1)<2500,0,IF(OR(TRIM(BL1)=\"\",TRIM(BL18)=\"\"),\"\",(BL1)*(BL18))))","v":""}]
[null,null,"Bayleton® FLO",null,null,null,null,null,null,null,1,"  2 x 2.5 gal/case",null,null,null,5,null,0.5,null,"oz/1,000",null,null,null,{"$f":"IF(TRIM(R20)<>\"\",(P20*128)/(R20*43.56),\"\")","v":29.38475665748393},null,null,null,null,null,null,"Tribute® Total",null,null,null,null,null,null,null,null,1,null,null,"  6 x 6  oz/case",null,null,null,36,null,3,null,"oz./acre",null,{"$f":"IF(TRIM(AW20)<>\"\",(AU20)/AW20,\"\")","v":12},null,null,null,null,null,null,null,"Calculate Select Rebate",null,null,{"$f":"IF(CM129>=2500,IF(TRIM(AW127)<>\"\",AW127,\"\"),\"\")","v":""}]
[null,null,{"$f":"CONCATENATE(IF(CH85=2,\"Chipco® Signature™\",\"Signature™ XTRA Stressgard\"))","v":"Signature™ XTRA Stressgard"},null,null,null,null,null,null,null,14,"  4 x 5.5 lbs/case",null,null,null,308,null,4,null,"oz/1,000",null,null,null,{"$f":"IF(TRIM(R21)<>\"\",(P21*16)/(R21*43.56),\"\")","v":28.28282828282828},null,null,null,null,null,null,"Specticle Total",null,null,null,null,null,null,null,null,2,null,null,"4 x 144 oz/case",null,null,null,1152,null,16,null,"oz/1,000",null,1.6]
[null,null,"Interface® Stressgard",null,null,null,null,null,null,null,9,"  2 x 2.5 gal/case",null,null,null,45,null,4,null,"oz/1,000",null,null,null,{"$f":"IF(TRIM(R22)<>\"\",(P22*128)/(R22*43.56),\"\")","v":33.057851239669418}]
[null,null,"Merit 75® WSP",null,null,null,null,null,null,null,1,"110 X 1.6 oz/drum",null,null,null,11,null,6.4,null,"oz/acre",null,null,null,{"$f":"IF(TRIM(R23)<>\"\",(P23*16)/(R23),\"\")","v":27.5}]
[null,null,null,null,null,null,null,null,null,null,null,null,null,null,null,null,null,null,null,null,null,null,null,{"$f":"IF(TRIM(R24)<>\"\",(P24*16)/(R24*43.56),\"\")","v":""}]
[null,null,"Tartan® Stressgard",null,null,null,null,null,null,null,6,"  2 X 2.5 gal/case",null,null,null,30,null,1.5,null,"oz/1,000",null,null,null,{"$f":"IF(TRIM(R25)<>\"\",(P25*128)/(R25*43.56),\"\")","v":58.76951331496786},null,null,null,null,null,null,{"$f":"CONCATENATE(\"Bayer Stressgard® PAK\",IF(CH85=2,\" - NOT AVAIL.\",CONCATENATE(\" - $\",FIXED(AR85,2,FALSE))))","v":"Bayer Stressgard® PAK - $4,800.00"},null,null,null,null,null,null,null,null,null,null,null,null,null,null,null,null,null,null,null,null,null,null,null,null,null,null,null,null,null,null,null,"Grand Total",{"$f":"IF(AND(TRIM(BL19)=\"\",TRIM(BL20)=\"\"),\"\",SUM(BL19,BL20))","v":""}]
[]
[null,null,null,null,null,null,null,null,null,null,null,null,null,null,null,null,null,null,null,null,null,null,null,null,null,null,null,null,null,null,{"$f":"IF(CH85=2,\"THIS PAK IS NOT AVAILABLE FOR CALIFORNIA CUSTOMERS.\",\"With Stressgard Formulation Technology, this PAK program enhances overall turf quality, improves plant health and protects against harsh environmental stress that can damage your turf.\")","v":"With Stressgard Formulation Technology, this PAK program enhances overall turf quality, improves plant health and protects against harsh environmental stress that can damage your turf."}]
[null,null,{"$f":"CONCATENATE(\"Bayer Essentials PAK\",IF(CH85=2,\" - NOT AVAIL.\",CONCATENATE(\" - $\",FIXED(AR80,2,FALSE))))","v":"Bayer Essentials PAK - $17,000.00"}]
[null,null,null,null,null,null,null,null,null,null,null,null,null,null,null,null,null,null,null,null,null,null,null,null,null,null,null,null,null,null,"PRODUCTS",null,null,null,null,null,null,null,null,"UNITS/\nPAK",null,null,"UNIT SIZE",null,null,null,"GAL/LB\n/OZ",null,"USE RATE",null,null,null,"ACRES\nTREATED",null,null,null,null,null,null,null,2500,10000,{"$f":"IF(AND($BL$17>=BI29,$BL$17<BJ29),((BJ29)-($BL$17)),\"\")","v":""}]
[null,null,{"$f":"IF(CH85=2,\"THIS PAK IS NOT AVAILABLE FOR CALIFORNIA CUSTOMERS.\",\"The Bayer Essentials PAK is built on key products you know, and trust, with the flexibility you demand.\")","v":"The Bayer Essentials PAK is built on key products you know, and trust, with the flexibility you demand."},null,null,null,null,null,null,null,null,null,null,null,null,null,null,null,null,null,null,null,null,null,null,null,null,null,null,null,null,null,null,null,null,null,null,null,null,null,null,null,null,null,null,null,null,null,null,null,null,null,null,null,null,null,null,null,null,null,10000,15000,{"$f":"IF(AND($BL$17>=BI30,$BL$17<BJ30),((BJ30)-($BL$17)),\"\")","v":""}]
[null,null,null,null,null,null,null,null,null,null,null,null,null,null,null,null,null,null,null,null,null,null,null,null,null,null,null,null,null,null,{"$f":"IF(CH97=2,\"Chipco Signature\",\"Signature XTRA Stressgard\")","v":"Signature XTRA Stressgard"},null,null,null,null,null,null,null,null,4,null,null,"  4 x 5.5 lbs/case",null,null,null,88,null,4,null,"oz/1,000",null,{"$f":"IF(TRIM(AW31)<>\"\",(AU31*16)/(AW31*43.56),\"\")","v":8.0808080808080796},null,null,null,null,null,null,null,15000,25000,""]
[null,null,"PRODUCTS",null,null,null,null,null,null,null,"UNITS/\nPAK","UNIT SIZE",null,null,null,"GAL/LB\n/OZ",null,"USE RATE",null,null,null,null,null,"ACRES\nTREATED",null,null,null,null,null,null,"Interface Stressgard",null,null,null,null,null,null,null,null,1,null,null,"  2 x 2.5 gal/case",null,null,null,5,null,4,null,"oz/1,000",null,{"$f":"IF(TRIM(AW32)<>\"\",(AU32*128)/(AW32*43.56),\"\")","v":3.6730945821854912},null,null,null,null,null,null,null,25000,28500,""]
[null,null,null,null,null,null,null,null,null,null,null,null,null,null,null,null,null,null,null,null,null,null,null,null,null,null,null,null,null,null,"Tartan Stressgard",null,null,null,null,null,null,null,null,1,null,null,"  2 X 2.5 gal/case",null,null,null,5,null,2,null,"oz/1,000",null,{"$f":"IF(TRIM(AW33)<>\"\",(AU33*128)/(AW33*43.56),\"\")","v":7.3461891643709825},null,null,null,null,null,null,null,28500,40000,""]
[null,null,"Bayleton FLO",null,null,null,null,null,null,null,1,"  2 x 2.5 gal/case",null,null,null,5,null,0.5,null,"oz/1,000",null,null,null,{"$f":"IF(TRIM(R34)<>\"\",(P34*128)/(R34*43.56),\"\")","v":29.38475665748393}]
[]
[null,null,{"$f":"IF(CH85=2,\"Chipco Signature\",\"Signature XTRA Stressgard\")","v":"Signature XTRA Stressgard"},null,null,null,null,null,null,null,8,"  4 x 5.5 lbs/case",null,null,null,176,null,4,null,"oz/1,000",null,null,null,{"$f":"IF(TRIM(R36)<>\"\",(P36*16)/(R36*43.56),\"\")","v":16.161616161616159},null,null,null,null,null,null,null,null,null,null,null,null,null,null,null,null,null,null,null,null,null,null,null,null,null,null,null,null,null,null,null,null,null,null,null,null,null,null,{"$f":"SUM(BK29:BK33)","v":0},{"$f":"IF(BL17>=2500,IF(BL3>=0.08,0.09,IF(BL3>=0.05,0.08,(BL18)+0.01)),\"\")","v":0.09},{"$f":"TEXT(BL36,\"0%\")","v":"9%"}]
[null,null,"26GT®",null,null,null,null,null,null,null,6,"  2 x 2.5 gal/case",null,null,null,30,null,3,null,"oz/1,000",null,null,null,{"$f":"IF(TRIM(R37)<>\"\",(P37*128)/(R37*43.56),\"\")","v":29.38475665748393},null,null,null,null,null,null,{"$f":"CONCATENATE(\"Bayer Fairy Ring PAK\",IF(CH85=4,\" - NOT AVAIL.\",CONCATENATE(\" - $\",FIXED(AR86,2,FALSE))))","v":"Bayer Fairy Ring PAK - $4,500.00"},null,null,null,null,null,null,null,null,null,null,null,null,null,null,null,null,null,null,null,null,null,null,null,null,null,null,null,null,null,{"$f":"IF(AND(BK36>0,BK36<40000),CONCATENATE(\"You are only \",TEXT(BK36,\"$#,##0\"),\" from moving up to Rebate Level \",TEXT(BL36,\"0%\"),\".\"),\"\")","v":""}]
[null,null,"Merit 75 WSP",null,null,null,null,null,null,null,1,"110 X 1.6 oz/drum",null,null,null,11,null,6.4,null,"oz/acre",null,null,null,{"$f":"IF(TRIM(R38)<>\"\",(P38*16)/(R38),\"\")","v":27.5},null,null,null,null,null,null,null,null,null,null,null,null,null,null,null,null,null,null,null,null,null,null,null,null,null,null,null,null,null,null,null,null,null,null,null,null,{"$f":"IF(AND(BK36>0,BK36<40000),\"You are only \",\"\")","v":""},{"$f":"IF(AND(BK36>0,BK36<40000),TEXT(BK36,\"$#,##0\"),\"\")","v":""},{"$f":"IF(AND(BK36>0,BK36<40000),\" from moving up to Rebate Level \",\"\")","v":""},null,null,{"$f":"IF(AND(BK36>0,BK36<40000),TEXT(BM36,\"0%\"),\"\")","v":""}]
[null,null,"Tartan Stressgard",null,null,null,null,null,null,null,3,"  2 X 2.5 gal/case",null,null,null,15,null,1.5,null,"oz/1,000",null,null,null,{"$f":"IF(TRIM(R39)<>\"\",(P39*128)/(R39*43.56),\"\")","v":29.38475665748393},null,null,null,null,null,null,{"$f":"IF(CH85=4,\"THIS PAK IS NOT AVAILABLE FOR NEW YORK CUSTOMERS.\",\"Preventative and curative fairy ring management tools.\")","v":"Preventative and curative fairy ring management tools."}]
[null,null,null,null,null,null,null,null,null,null,null,null,null,null,null,null,null,null,null,null,null,null,null,null,null,null,null,null,null,null,"PRODUCTS",null,null,null,null,null,null,null,null,"UNITS/\nPAK",null,null,"UNIT SIZE",null,null,null,"GAL/LB\n/OZ",null,"USE RATE",null,null,null,"ACRES\nTREATED"]
[]
[null,null,{"$f":"CONCATENATE(\"Bayer Fairway PAK\",IF(CH85=2,\" - NOT AVAIL.\",CONCATENATE(\" - $\",FIXED(AR81,2,FALSE))))","v":"Bayer Fairway PAK - $12,000.00"},null,null,null,null,null,null,null,null,null,null,null,null,null,null,null,null,null,null,null,null,null,null,null,null,null,null,null,"Tartan Stressgard",null,null,null,null,null,null,null,null,1,null,null,"  2 X 2.5 gal/case",null,null,null,5,null,2,null,"oz/1,000",null,{"$f":"IF(TRIM(AW42)<>\"\",(AU42*128)/(AW42*43.56),\"\")","v":7.3461891643709825}]
[null,null,null,null,null,null,null,null,null,null,null,null,null,null,null,null,null,null,null,null,null,null,null,null,null,null,null,null,null,null,"Prostar 70 WG",null,null,null,null,null,null,null,null,4,null,null,"4 x 3 lb/case ",null,null,null,48,null,2.2000000000000002,null,"oz/1,000",null,{"$f":"IF(TRIM(AW43)<>\"\",(AU43*16)/(AW43*43.56),\"\")","v":8.0140245429501622}]
[null,null,{"$f":"IF(CH85=2,\"THIS PAK IS NOT AVAILABLE FOR CALIFORNIA CUSTOMERS.\",\"Pairs well with Fiata® Stressgard utilizing select product rebate.\")","v":"Pairs well with Fiata® Stressgard utilizing select product rebate."}]
[null,null,"PRODUCTS",null,null,null,null,null,null,null,"UNITS/\nPAK","UNIT SIZE",null,null,null,"GAL/LB\n/OZ",null,"USE RATE",null,null,null,null,null,"ACRES\nTREATED"]
[null,null,null,null,null,null,null,null,null,null,null,null,null,null,null,null,null,null,null,null,null,null,null,null,null,null,null,null,null,null,{"$f":"CONCATENATE(\"Bayer Pythium PAK\",IF(CH85=2,\" - NOT AVAIL.\",CONCATENATE(\" - $\",FIXED(AR87,2,FALSE))))","v":"Bayer Pythium PAK - $4,350.00"}]
[null,null,"Mirage® Stressgard",null,null,null,null,null,null,null,2,"  2 x 2.5 gal/case",null,null,null,10,null,1,null,"oz/1,000",null,null,null,{"$f":"IF(TRIM(R47)<>\"\",(P47*128)/(R47*43.56),\"\")","v":29.38475665748393}]
[null,null,"Interface Stressgard",null,null,null,null,null,null,null,6,"  2 x 2.5 gal/case",null,null,null,30,null,3,null,"oz/1,000",null,null,null,{"$f":"IF(TRIM(R48)<>\"\",(P48*128)/(R48*43.56),\"\")","v":29.38475665748393},null,null,null,null,null,null,{"$f":"IF(CH85=2,\"THIS PAK IS NOT AVAILABLE FOR CALIFORNIA CUSTOMERS.\",\"Preventative and curative pythium management tools.\")","v":"Preventative and curative pythium management tools."}]
[null,null,"Bayleton FLO",null,null,null,null,null,null,null,1,"  2 x 2.5 gal/case",null,null,null,5,null,0.5,null,"oz/1,000",null,null,null,{"$f":"IF(TRIM(R49)<>\"\",(P49*128)/(R49*43.56),\"\")","v":29.38475665748393},null,null,null,null,null,null,"PRODUCTS",null,null,null,null,null,null,null,null,"UNITS/\nPAK",null,null,"UNIT SIZE",null,null,null,"GAL/LB\n/OZ",null,"USE RATE",null,null,null,"ACRES\nTREATED"]
[null,null,"26GT",null,null,null,null,null,null,null,6,"  2 x 2.5 gal/case",null,null,null,30,null,3,null,"oz/1,000",null,null,null,{"$f":"IF(TRIM(R50)<>\"\",(P50*128)/(R50*43.56),\"\")","v":29.38475665748393}]
[null,null,null,null,null,null,null,null,null,null,null,null,null,null,null,null,null,null,null,null,null,null,null,null,null,null,null,null,null,null,{"$f":"IF(CH85=2,\"Chipco Signature\",\"Signature XTRA Stressgard\")","v":"Signature XTRA Stressgard"},null,null,null,null,null,null,null,null,4,null,null,"  4 x 5.5 lbs/case",null,null,null,88,null,4,null,"oz/1,000",null,{"$f":"IF(TRIM(AW51)<>\"\",(AU51*16)/(AW51*43.56),\"\")","v":8.0808080808080796},null,null,null,null,null,null,null,null,null,null,null,null,null,null,null,null,null,null,null,null,null,null,null,null,null,null,null,null,null,null,null,null,null,null,null,1]
[null,null,null,null,null,null,null,null,null,null,null,null,null,null,null,null,null,null,null,null,null,null,null,null,null,null,null,null,null,null,"Banol",null,null,null,null,null,null,null,null,3,null,null,"  2 x 1 gal/case",null,null,null,6,null,2,null,"oz/1,000",null,{"$f":"IF(TRIM(AW52)<>\"\",(AU52*128)/(AW52*43.56),\"\")","v":8.8154269972451793}]
[null,null,{"$f":"CONCATENATE(\"Core Program PAK\",IF(OR(CH85=2,CH85=4),\" - NOT AVAIL.\",CONCATENATE(\" - $\",FIXED(AR82,2,FALSE))))","v":"Core Program PAK - $10,250.00"},null,null,null,null,null,null,null,null,null,null,null,null,null,null,null,null,null,null,null,null,null,null,null,null,null,null,null,null,null,null,null,null,null,null,null,null,null,null,null,null,null,null,null,null,null,null,null,null,null,{"$f":"IF(TRIM(AW53)<>\"\",(AU53*16)/(AW53*43.56),\"\")","v":""}]
[]
[null,null,{"$f":"IF(CH85=2,\"THIS PAK IS NOT AVAILABLE FOR CALIFORNIA CUSTOMERS.\",IF(CH85=4,\"THIS PAK IS NOT AVAILABLE FOR NEW YORK CUSTOMERS.\",\"Build your success around our industry leading solutions.  Perfect turf starts with these core progam components.\"))","v":"Build your success around our industry leading solutions.  Perfect turf starts with these core progam components."},null,null,null,null,null,null,null,null,null,null,null,null,null,null,null,null,null,null,null,null,null,null,null,null,null,null,null,null,null,null,null,null,null,null,null,null,null,null,null,null,null,null,null,null,null,null,null,null,null,null,null,null,null,null,null,null,null,null,null,null,null,null,null,null,null,null,null,null,null,null,null,null,null,null,null,null,1]
[null,null,null,null,null,null,null,null,null,null,null,null,null,null,null,null,null,null,null,null,null,null,null,null,null,null,null,null,null,null,{"$f":"CONCATENATE(\"Bayer Leaf Spot PAK\",IF(CH85=2,\" - NOT AVAIL.\",CONCATENATE(\" - $\",FIXED(AR88,2,FALSE))))","v":"Bayer Leaf Spot PAK - $3,550.00"}]
[null,null,"PRODUCTS",null,null,null,null,null,null,null,"UNITS/\nPAK","UNIT SIZE",null,null,null,"GAL/LB\n/OZ",null,"USE RATE",null,null,null,null,null,"ACRES\nTREATED"]
[null,null,null,null,null,null,null,null,null,null,null,null,null,null,null,null,null,null,null,null,null,null,null,null,null,null,null,null,null,null,{"$f":"IF(CH85=2,\"THIS PAK IS NOT AVAILABLE FOR CALIFORNIA CUSTOMERS.\",\"Industry-leading solutions for effective leaf spot control.\")","v":"Industry-leading solutions for effective leaf spot control."}]
[null,null,{"$f":"IF(CH85=2,\"Chipco Signature\",\"Signature XTRA Stressgard\")","v":"Signature XTRA Stressgard"},null,null,null,null,null,null,null,4,"  4 x 5.5 lbs/case",null,null,null,88,null,4,null,"oz/1,000",null,null,null,{"$f":"IF(TRIM(R59)<>\"\",(P59*16)/(R59*43.56),\"\")","v":8.0808080808080796},null,null,null,null,null,null,"PRODUCTS",null,null,null,null,null,null,null,null,"UNITS/\nPAK",null,null,"UNIT SIZE",null,null,null,"GAL/LB\n/OZ",null,"USE RATE",null,null,null,"ACRES\nTREATED"]
[null,null,"Interface Stressgard",null,null,null,null,null,null,null,2,"  2 x 2.5 gal/case",null,null,null,10,null,4,null,"oz/1,000",null,null,null,{"$f":"IF(TRIM(R60)<>\"\",(P60*128)/(R60*43.56),\"\")","v":7.3461891643709825}]
[null,null,"Prostar® 70 WG",null,null,null,null,null,null,null,4,"4 x 3 lb/case ",null,null,null,48,null,2.2000000000000002,null,"oz/1,000",null,null,null,{"$f":"IF(TRIM(R61)<>\"\",(P61*16)/(R61*43.56),\"\")","v":8.0140245429501622},null,null,null,null,null,null,"Interface Stressgard",null,null,null,null,null,null,null,null,2,null,null,"  2 x 2.5 gal/case",null,null,null,10,null,4,null,"oz/1,000",null,{"$f":"IF(TRIM(AW61)<>\"\",(AU61*128)/(AW61*43.56),\"\")","v":7.3461891643709825}]
[null,null,"Banol",null,null,null,null,null,null,null,2,"  2 x 1 gal/case",null,null,null,4,null,2,null,"oz/1,000",null,null,null,{"$f":"IF(TRIM(R62)<>\"\",(P62*128)/(R62*43.56),\"\")","v":5.8769513314967856},null,null,null,null,null,null,{"$f":"IF(CH75=2,\"Chipco Signature\",\"Signature XTRA Stressgard\")","v":"Signature XTRA Stressgard"},null,null,null,null,null,null,null,null,4,null,null,"  4 x 5.5 lbs/case",null,null,null,88,null,4,null,"oz/1,000",null,{"$f":"IF(TRIM(AW62)<>\"\",(AU62*16)/(AW62*43.56),\"\")","v":8.0808080808080796}]
[null,null,"Tartan Stressgard",null,null,null,null,null,null,null,1,"  2 x 2.5 gal/case",null,null,null,5,null,2,null,"oz/1,000",null,null,null,{"$f":"IF(TRIM(R63)<>\"\",(P63*128)/(R63*43.56),\"\")","v":7.3461891643709825}]
[null,null,"Mirage Stressgard",null,null,null,null,null,null,null,1,"  2 x 2.5 gal/case",null,null,null,5,null,1,null,"oz/1,000",null,null,null,{"$f":"IF(TRIM(R64)<>\"\",(P64*128)/(R64*43.56),\"\")","v":14.692378328741965}]
[null,null,null,null,null,null,null,null,null,null,null,null,null,null,null,null,null,null,null,null,null,null,null,null,null,null,null,null,null,null,{"$f":"CONCATENATE(\"Bayer Utility PAK - $\",FIXED(AR89,2,FALSE))","v":"Bayer Utility PAK - $2,400.00"}]
[]
[null,null,null,null,null,null,null,null,null,null,null,null,null,null,null,null,null,null,null,null,null,null,null,null,null,null,null,null,null,null,"Versatile uses including proven solution for your snow mold problems as well as Dollar Spot, Brown Patch, Anthracnose, and other diseases while enhancing turf quality."]
[null,null,{"$f":"CONCATENATE(\"Bayer Greens PAK\",IF(CH85=2,\" - NOT AVAIL.\",CONCATENATE(\" - $\",FIXED(AR83,2,FALSE))))","v":"Bayer Greens PAK - $6,250.00"}]
[null,null,null,null,null,null,null,null,null,null,null,null,null,null,null,null,null,null,null,null,null,null,null,null,null,null,null,null,null,null,"PRODUCTS",null,null,null,null,null,null,null,null,"UNITS/\nPAK",null,null,"UNIT SIZE",null,null,null,"GAL/LB\n/OZ",null,"USE RATE",null,null,null,"ACRES\nTREATED"]
[null,null,{"$f":"IF(CH85=2,\"THIS PAK IS NOT AVAILABLE FOR CALIFORNIA CUSTOMERS.\",\"The standard for your greens management program, anchored by the products that provide superior turf quality.\")","v":"The standard for your greens management program, anchored by the products that provide superior turf quality."}]
[null,null,"PRODUCTS",null,null,null,null,null,null,null,"UNITS/\nPAK","UNIT SIZE",null,null,null,"GAL/LB\n/OZ",null,"USE RATE",null,null,null,null,null,"ACRES\nTREATED",null,null,null,null,null,null,"Interface Stressgard",null,null,null,null,null,null,null,null,3,null,null,"  2 x 2.5 gal/case",null,null,null,15,null,4,null,"oz/1,000",null,{"$f":"IF(TRIM(AW71)<>\"\",(AU71*128)/(AW71*43.56),\"\")","v":11.019283746556473}]
[null,null,null,null,null,null,null,null,null,null,null,null,null,null,null,null,null,null,null,null,null,null,null,null,null,null,null,null,null,null,"Mirage Stressgard",null,null,null,null,null,null,null,null,1,null,null,"  2 x 2.5 gal/case",null,null,null,5,null,1,null,"oz/1,000",null,{"$f":"IF(TRIM(AW72)<>\"\",(AU72*128)/(AW72*43.56),\"\")","v":14.692378328741965}]
[null,null,{"$f":"IF(CH85=2,\"Chipco Signature\",\"Signature XTRA Stressgard\")","v":"Signature XTRA Stressgard"},null,null,null,null,null,null,null,8,"  4 x 5.5 lbs/case",null,null,null,176,null,4,null,"oz/1,000",null,null,null,{"$f":"IF(TRIM(R73)<>\"\",(P73*16)/(R73*43.56),\"\")","v":16.161616161616159}]
[null,null,"26GT",null,null,null,null,null,null,null,5,"  2 x 2.5 gal/case",null,null,null,25,null,4,null,"oz/1,000",null,null,null,{"$f":"IF(TRIM(R74)<>\"\",(P74*128)/(R74*43.56),\"\")","v":18.365472910927455}]
[]
[]
[null,null,null,null,null,null,null,null,null,null,null,null,null,null,null,null,null,null,null,null,null,null,null,null,null,null,null,null,null,null,null,null,null,null,null,null,null,null,null,null,null,null,null,null,null,null,null,null,null,null,null,null,null,null,null,null,null,null,null,null,null,null,null,null,null,null,null,null,null,null,null,null,null,null,null,null,null,null,null,null,null,null,null,null,5150,null,null,"Regular","California","Washington","Total Purch","HTHT Calc"]
[null,null,null,null,null,null,null,null,null,null,null,null,null,null,null,null,null,null,null,null,null,null,null,null,null,null,null,null,"PRODUCTS",null,null,null,null,null,null,null,null,null,null,null,null,"# PAKS",null,"PRICE/PAK",null,null,null,"TOTAL $",null,null,null,null,null,null,null,null,null,null,null,null,null,null,null,null,null,null,null,null,null,null,null,null,null,null,null,null,null,null,null,null,null,null,null,null,4500,null,null,28500,null,{"$f":"CJ78+(CJ78*0.007)","v":28699.5},{"$f":"IF(TRIM(AV79)<>\"\",AP79*CJ78,\"\")","v":""},{"$f":"IF(TRIM(AP79)<>\"\",AP79*237,\"\")","v":""}]
[null,null,null,null,null,null,null,null,null,null,null,null,null,null,null,null,null,null,null,null,null,null,null,null,null,null,null,null,{"$f":"IF(CH85=2,\"\",\"Bayer Season PAK\")","v":"Bayer Season PAK"},null,null,null,null,null,null,null,null,null,null,null,null,null,null,{"$f":"IF(CH85=2,\"\",IF($CH$85=1,CL78,IF($CH$85=2,CK78,CJ78)))","v":28500},null,null,null,{"$f":"IF(CH85=2,\"\",IF(TRIM(AP79)<>\"\",AP79*AR79,\"\"))","v":""},null,null,null,null,null,null,null,null,null,null,null,null,null,null,null,null,null,null,null,null,null,null,null,null,null,null,null,null,null,null,null,null,null,null,null,null,4350,null,null,17000,null,17119,{"$f":"IF(TRIM(AV80)<>\"\",AP80*CJ79,\"\")","v":""},{"$f":"IF(TRIM(AP80)<>\"\",AP80*95,\"\")","v":""}]
[null,null,null,null,null,null,null,null,null,null,null,null,null,null,null,null,null,null,null,null,null,null,null,null,null,null,null,null,{"$f":"IF(CH85=2,\"\",\"Bayer Essentials PAK\")","v":"Bayer Essentials PAK"},null,null,null,null,null,null,null,null,null,null,null,null,null,null,{"$f":"IF(CH85=2,\"\",IF($CH$85=1,CL79,IF($CH$85=2,CK79,CJ79)))","v":17000},null,null,null,{"$f":"IF(CH85=2,\"\",IF(TRIM(AP80)<>\"\",AP80*AR80,\"\"))","v":""},null,null,null,null,null,null,null,null,null,null,null,null,null,null,null,null,null,null,null,null,null,null,null,null,null,null,null,null,null,null,null,null,null,null,null,null,3550,null,null,12000,null,12084,{"$f":"IF(TRIM(AV81)<>\"\",AP81*CJ80,\"\")","v":""},{"$f":"IF(TRIM(AP81)<>\"\",AP81*55,\"\")","v":""}]
[null,null,null,null,null,null,null,null,null,null,null,null,null,null,null,null,null,null,null,null,null,null,null,null,null,null,null,null,{"$f":"IF(CH85=2,\"\",\"Bayer Fairway PAK\")","v":"Bayer Fairway PAK"},null,null,null,null,null,null,null,null,null,null,null,null,null,null,{"$f":"IF(CH85=2,\"\",IF($CH$85=1,CL80,IF($CH$85=2,CK80,CJ80)))","v":12000},null,null,null,{"$f":"IF(CH85=2,\"\",IF(TRIM(AP81)<>\"\",AP81*AR81,\"\"))","v":""},null,null,null,null,null,null,null,null,null,null,null,null,null,null,null,null,null,null,null,null,null,null,null,null,null,null,null,null,null,null,null,null,null,null,null,null,null,null,null,10250,null,10321.75,{"$f":"IF(TRIM(AP82)<>\"\",AP82*CJ81,\"\")","v":""},{"$f":"IF(TRIM(AP82)<>\"\",AP82*44,\"\")","v":""}]
[null,null,null,null,null,null,null,null,null,null,null,null,null,null,null,null,null,null,null,null,null,null,null,null,null,null,null,null,{"$f":"IF(OR(CH85=2,CH85=4),\"\",\"Core Program PAK\")","v":"Core Program PAK"},null,null,null,null,null,null,null,null,null,null,null,null,null,null,{"$f":"IF(OR(CH85=2,CH85=4),\"\",IF($CH$85=1,CL81,IF($CH$85=2,CK81,CJ81)))","v":10250},null,null,null,{"$f":"IF(OR(CH85=2,CH85=4),\"\",IF(TRIM(AP82)<>\"\",AP82*AR82,\"\"))","v":""},null,null,null,null,null,null,null,null,null,null,null,null,null,null,null,null,null,null,null,null,null,null,null,null,null,null,null,null,null,null,null,null,null,null,null,null,null,null,null,6250,null,6293.75,"",{"$f":"IF(TRIM(AP83)<>\"\",AP83*46,\"\")","v":""}]
[null,null,null,null,null,null,null,null,null,null,null,null,null,null,null,null,null,null,null,null,null,null,null,null,null,null,null,null,{"$f":"IF(CH85=2,\"\",\"Bayer Greens PAK\")","v":"Bayer Greens PAK"},null,null,null,null,null,null,null,null,null,null,null,null,null,null,{"$f":"IF($CH$85=1,CL82,IF($CH$85=2,CK82,CJ82))","v":6250},null,null,null,{"$f":"IF(CH85=2,\"\",IF(TRIM(AP83)<>\"\",AP83*AR83,\"\"))","v":""},null,null,null,null,null,null,null,null,null,null,null,null,null,null,null,null,null,null,null,null,null,null,null,null,null,null,null,null,null,null,{"$f":"MOD(N93,0.5)","v":0},null,null,null,null,null,null,null,null,5150,{"$f":"CJ83+(CJ83*0.02175)","v":5262.0124999999998},5186.05,"",{"$f":"IF(TRIM(AP84)<>\"\",AP84*26,\"\")","v":""}]
[null,null,null,null,null,null,null,null,null,null,null,null,null,null,null,null,null,null,null,null,null,null,null,null,null,null,null,null,{"$f":"IF(OR(CH85=1,CH85=4),\"\",\"Warm Season Herbicide PAK\")","v":"Warm Season Herbicide PAK"},null,null,null,null,null,null,null,null,null,null,null,null,null,null,5150,null,null,null,{"$f":"IF(OR(CH85=1,CH85=4),\"\",IF(TRIM(AP84)<>\"\",AP84*AR84,\"\"))","v":""},null,null,null,null,null,null,null,null,null,null,null,null,null,null,null,null,null,null,null,null,null,null,null,null,null,null,null,null,null,null,null,null,null,null,null,null,null,"WA/CA/(N/A)",null,4800,null,4833.6000000000004,"",{"$f":"IF(TRIM(AP85)<>\"\",AP85*43,\"\")","v":""}]
[null,null,null,null,null,null,null,null,null,null,null,null,null,null,null,null,null,null,null,null,null,null,null,null,null,null,null,null,{"$f":"IF(CH85=2,\"\",\"Bayer Stressgard PAK\")","v":"Bayer Stressgard PAK"},null,null,null,null,null,null,null,null,null,null,null,null,null,null,4800,null,null,null,{"$f":"IF(CH85=2,\"\",IF(TRIM(AP85)<>\"\",AP85*AR85,\"\"))","v":""},null,null,null,null,null,null,null,null,null,null,null,null,null,null,null,null,null,null,null,null,null,null,null,null,null,null,null,null,null,null,{"$f":"MOD(N94,0.5)","v":0},null,null,null,null,null,null,3,null,4500,4597.875,4531.5,""]
[null,null,null,null,null,null,null,null,null,null,null,null,null,null,null,null,null,null,null,null,null,null,null,null,null,null,null,null,{"$f":"IF(CH85=4,\"\",\"Bayer Fairy Ring PAK\")","v":"Bayer Fairy Ring PAK"},null,null,null,null,null,null,null,null,null,null,null,null,null,null,{"$f":"IF(CH85=4,\"\",IF($CH$85=1,CL85,IF($CH$85=2,CK85,CJ85)))","v":4500},null,null,null,{"$f":"IF(CH85=4,\"\",IF(TRIM(AP86)<>\"\",AP86*AR86,\"\"))","v":""},null,null,null,null,null,null,null,null,null,null,null,null,null,null,null,null,null,null,null,null,null,null,null,null,null,null,null,null,null,null,{"$f":"MOD(N98,0.25)","v":0},null,null,null,null,null,null,null,null,4350,null,{"$f":"CJ86+(CJ86*0.007)","v":4380.45},"",{"$f":"IF(TRIM(AP87)<>\"\",AP87*19,\"\")","v":""}]
[null,null,null,null,null,null,null,null,null,null,null,null,null,null,null,null,null,null,null,null,null,null,null,null,null,null,null,null,{"$f":"IF(CH85=2,\"\",\"Bayer Pythium PAK\")","v":"Bayer Pythium PAK"},null,null,null,null,null,null,null,null,null,null,null,null,null,null,4350,null,null,null,{"$f":"IF(CH85=2,\"\",IF(TRIM(AP87)<>\"\",AP87*AR87,\"\"))","v":""},null,null,null,null,null,null,null,null,null,null,null,null,null,null,null,null,null,null,null,null,null,null,null,null,null,null,null,null,null,null,null,null,null,null,null,null,null,null,null,3550,null,3574.85,"",{"$f":"IF(TRIM(AP88)<>\"\",AP88*20,\"\")","v":""}]
[null,null,null,null,null,null,null,null,null,null,null,null,null,null,null,null,null,null,null,null,null,null,null,null,null,null,null,null,{"$f":"IF(CH85=2,\"\",\"Bayer Leaf Spot PAK\")","v":"Bayer Leaf Spot PAK"},null,null,null,null,null,null,null,null,null,null,null,null,null,null,3550,null,null,null,{"$f":"IF(CH85=2,\"\",IF(TRIM(AP88)<>\"\",AP88*AR88,\"\"))","v":""},null,null,null,null,null,null,null,null,null,null,null,null,null,null,null,null,null,null,null,null,null,null,null,null,null,null,null,null,null,null,null,null,null,null,null,null,null,null,null,2400,{"$f":"CJ88+(CJ88*0.02175)","v":2452.1999999999998},{"$f":"CJ88+(CJ88*0.007)","v":2416.8000000000002},"",{"$f":"IF(TRIM(AP89)<>\"\",AP89*34,\"\")","v":""}]
[null,null,null,null,null,null,null,null,null,null,null,null,null,null,null,null,null,null,null,null,null,null,null,null,null,null,null,null,"Bayer Utility PAK",null,null,null,null,null,null,null,null,null,null,null,null,null,null,{"$f":"IF($CH$85=1,CL88,IF($CH$85=2,CK88,CJ88))","v":2400},null,null,null,{"$f":"IF(TRIM(AP89)<>\"\",AP89*AR89,\"\")","v":""},null,null,null,null,null,null,null,null,null,null,null,null,null,null,null,null,null,null,null,null,null,null,null,null,null,null,null,null,null,null,{"$f":"MOD(N102,0.5)","v":0},null,null,null,null,null,null,null,null,null,null,null,{"$f":"SUM(CM78:CM88)","v":0}]
[null,null,null,null,null,null,null,null,null,null,null,null,null,null,null,null,null,null,null,null,null,null,null,null,null,null,null,null,null,null,null,null,null,null,null,null,null,null,null,null,null,null,null,null,null,null,null,"(A)",{"$f":"IF(SUM(AV79:AY89)>0,SUM(AV79:AY89),\"\")","v":""}]
[null,null,null,null,null,null,null,null,null,null,null,null,null,null,null,null,null,null,null,null,null,null,null,null,null,null,null,null,null,null,null,null,null,null,null,null,null,null,null,null,null,null,null,null,null,null,null,null,null,null,null,null,null,null,null,null,null,null,null,null,null,null,null,null,null,null,null,null,null,null,null,null,null,null,null,null,null,null,{"$f":"MOD(N109,0.5)","v":0},null,null,null,null,null,null,null,null,"Regular","California","Washington","Total Purch"]
[null,"AGENCY PRODUCTS*",null,null,null,null,null,null,null,null,"UNIT SIZE",null,null,"# UNITS",null,null,"PRICE/UNIT",null,null,null," USE RATE\n/ 1,000 ft2",null,null,null,"USE RATE\n/ ACRE",null,null,null,null,"ACRES TREATED\n/ UNIT",null,null,null,null,"TOTAL $",null,null,null,null,null,null,"SELECT REBATE/\nMINIMUM QTYǂ",null,null,null,null,null,"SELECT\nREBATE $",null,null,null,null,null,null,null,null,null,null,null,null,null,null,null,null,null,null,null,null,null,null,null,null,null,null,null,null,null,null,{"$f":"MOD(N111,0.125)","v":0},null,null,null,null,null,null,null,null,1875,{"$f":"CJ92 + (CJ92*0.02175)","v":1915.78125},{"$f":"CJ92 + (CJ92*0.007)","v":1888.125},{"$f":"IF(TRIM(N93)<>\"\",N93*CJ92,\"\")","v":""}]
[null,"Banol",null,null,null,null,null,null,null,null,"  2 X 2.5 gal/case",null,null,null,null,null,{"$f":"IF($CH$85=1,CL92,IF($CH$85=2,CK92,CJ92))","v":1875},null,null,null,2,null,null,null,{"$f":"IF(TRIM(U93)<>\"\",U93*43.56,\"\")","v":87.12},null,null,null,null,{"$f":"IF(TRIM(Y93)<>\"\",IF(TRIM(N93)<>\"\",(N93*(5*128))/Y93,(5*128)/Y93),\"\")","v":7.3461891643709825},null,null,null,null,{"$f":"IF(TRIM(N93)<>\"\",N93*Q93,\"\")","v":""},null,null,null,null,null,null," $60/gal – 10 gal",null,null,null,null,null,{"$f":"IF(TRIM(N93)<>\"\",IF(VALUE(CE124)>=10,((N93)/0.2)*60,\"\"),\"\")","v":""},null,null,null,null,null,null,null,null,null,null,null,null,null,null,null,null,null,null,null,null,null,null,null,null,null,null,null,null,null,null,null,null,null,null,null,null,null,null,null,2700,{"$f":"CJ93 + (CJ93*0.02175)","v":2758.7249999999999},{"$f":"CJ93 + (CJ93*0.007)","v":2718.9},{"$f":"IF(TRIM(AI94)<>\"\",N94*CJ93,\"\")","v":""}]
[null,{"$f":"IF(CH85=2,\"\",\"Bayleton FLO\")","v":"Bayleton FLO"},null,null,null,null,null,null,null,null,{"$f":"IF(CH85=2,\"\",\"2 X 2.5 gal/case\")","v":"2 X 2.5 gal/case"},null,null,null,null,null,{"$f":"IF($CH$85=1,CL93,IF($CH$85=2,\"\",CJ93))","v":2700},null,null,null,0.5,null,null,null,{"$f":"IF(CH85=2,\"\",IF(TRIM(U94)<>\"\",U94*43.56,\"\"))","v":21.78},null,null,null,null,{"$f":"IF(CH85=2,\"\",IF(TRIM(Y94)<>\"\",IF(TRIM(N94)<>\"\",(N94*(5*128))/Y94,(5*128)/Y94),\"\"))","v":29.38475665748393},null,null,null,null,{"$f":"IF(CH85=2,\"\",IF(TRIM(N94)<>\"\",N94*Q94,\"\"))","v":""},null,null,null,null,null,null,{"$f":"IF(CH85=2,\"\",\"$70/gal – 10 gal\")","v":"$70/gal – 10 gal"},null,null,null,null,null,{"$f":"IF(CH85=2,\"\",IF(TRIM(N94)<>\"\",IF(VALUE(CE126)>=10,((N94)/0.2)*70,\"\"),\"\"))","v":""},null,null,null,null,null,null,null,null,null,null,null,null,null,null,null,null,null,null,null,null,null,null,null,null,null,null,null,null,null,null,null,null,null,null,null,null,null,null,null,769.6,786.33879999999999,774.98720000000003,{"$f":"IF(TRIM(N95)<>\"\",N95*CJ94,\"\")","v":""}]
[null,{"$f":"IF(OR(CH85=1,CH85=4),\"\",\"Celsius® WG\")","v":"Celsius® WG"},null,null,null,null,null,null,null,null,{"$f":"IF(OR(CH85=1,CH85=4),\"\",\"8 X 10 oz/case\")","v":"8 X 10 oz/case"},null,null,null,null,null,{"$f":"IF(OR(CH85=1,CH85=4),\"\",IF($CH$85=1,CL94,IF($CH$85=2,CK94,CJ94)))","v":769.6},null,null,null,8.5000000000000006E-2,null,null,null,{"$f":"IF(OR(CH85=1,CH85=4),\"\",IF(TRIM(U95)<>\"\",U95*43.56,\"\"))","v":3.7026000000000003},null,null,null,null,{"$f":"IF(OR(CH85=1,CH85=4),\"\",IF(TRIM(Y95)<>\"\",IF(TRIM(N95)<>\"\",(N95*(8*10))/Y95,(8*10)/Y95),\"\"))","v":21.606438718738183},null,null,null,null,{"$f":"IF(OR(CH85=1,CH85=4),\"\",IF(TRIM(N95)<>\"\",N95*Q95,\"\"))","v":""},null,null,null,null,null,null,{"$f":"IF(OR(CH85=1,CH85=4),\"\",\" $15/case – 2 case\")","v":" $15/case – 2 case"},null,null,null,null,null,{"$f":"IF(OR(CH85=1,CH85=4),\"\",IF(TRIM(N95)<>\"\",IF(VALUE(N95)>=2,((N95)/0.125)*1.875,\"\"),\"\"))","v":""},null,null,null,null,null,null,null,null,null,null,null,null,null,null,null,null,null,null,null,null,null,null,null,null,null,null,null,null,null,null,{"$f":"MOD(N115,0.5)","v":0},null,null,null,null,null,null,null,null,220,224.785,221.54,""]
[null,{"$f":"IF(OR(CH85=1,CH85=2,CH85=4),\"\",\"Chipco Choice\")","v":"Chipco Choice"},null,null,null,null,null,null,null,null,{"$f":"IF(OR(CH85=1,CH85=2,CH85=4),\"\",\"1Yr Agreement/acre\")","v":"1Yr Agreement/acre"},null,null,null,null,null,{"$f":"IF(OR(CH85=1,CH85=2,CH85=4),\"\",CJ95)","v":220},null,null,null,null,null,null,null,null,null,null,null,null,null,null,null,null,null,{"$f":"IF(OR(CH85=1,CH85=2,CH85=4),\"\",IF(TRIM(N96)<>\"\",N96*Q96,\"\"))","v":""},null,null,null,null,null,null,{"$f":"IF(OR(CH85=1,CH85=2,CH85=4),\"\",\"$10/acre – 45 acre\")","v":"$10/acre – 45 acre"},null,null,null,null,null,{"$f":"IF(OR(CH85=1,CH85=2,CH85=4),\"\",IF(TRIM(N96)<>\"\",IF(VALUE(N96)>=45,(N96)*10,\"\"),\"\"))","v":""},null,null,null,null,null,null,null,null,null,null,null,null,null,null,null,null,null,null,null,null,null,null,null,null,null,null,null,null,null,null,null,null,null,null,null,null,null,null,null,250,255.4375,251.75,"",{"$f":"IF(TRIM(N97)<>\"\",CJ96*N97*0.01,\"\")","v":""}]
[null,"Fiata®Stressgard",null,null,null,null,null,null,null,null,"  2 X 2.5 gal/case",null,null,null,null,null,250,null,null,null,5,null,null,null,{"$f":"IF(TRIM(U97)<>\"\",U97*43.56,\"\")","v":217.8},null,null,null,null,{"$f":"IF(TRIM(Y97)<>\"\",IF(TRIM(N97)<>\"\",(N97*(5*128))/Y97,(5*128)/Y97),\"\")","v":2.9384756657483928},null,null,null,null,{"$f":"IF(TRIM(N97)<>\"\",N97*Q97,\"\")","v":""},null,null,null,null,null,null," $10/gal – 100 gal",null,null,null,null,null,{"$f":"IF(TRIM(N97)<>\"\",IF(VALUE(N97)>=20,((N97)/0.2)*10,\"\"),\"\")","v":""},null,null,null,null,null,null,null,null,null,null,null,null,null,null,null,null,null,null,null,null,null,null,null,null,null,null,null,null,null,null,{"$f":"MOD(N117,0.05)","v":0},null,null,null,null,null,null,null,null,772.5,789.301875,777.90750000000003,"",{"$f":"IF(TRIM(N98)<>\"\",CJ97*N98*0.01,\"\")","v":""}]
[null,"Interface Stressgard",null,null,null,null,null,null,null,null,"  2 X 2.5 gal/case",null,null,null,null,null,772.5,null,null,null,4,null,null,null,174.24,null,null,null,null,{"$f":"IF(TRIM(Y98)<>\"\",IF(TRIM(N98)<>\"\",(N98*(5*128))/Y98,(5*128)/Y98),\"\")","v":3.6730945821854912},null,null,null,null,"",null,null,null,null,null,null," $15/gal – 40 gal",null,null,null,null,null,{"$f":"IF(TRIM(N98)<>\"\",IF(VALUE(CE130)>=40,((N98)/0.2)*15,\"\"),\"\")","v":""},null,null,null,null,null,null,null,null,null,null,null,null,null,null,null,null,null,null,null,null,null,null,null,null,null,null,null,null,null,null,{"$f":"MOD(N118,0.25)","v":0},null,null,null,null,null,null,null,null,1250,1277.1875,1258.75,""]
[null,"Merit 75 WSP Mega Mini",null,null,null,null,null,null,null,null,"110 X 1.6 oz/drum",null,null,null,null,null,1250,null,null,null,0.19700000000000001,null,null,null,8.5813200000000016,null,null,null,null,{"$f":"IF(TRIM(Y99)<>\"\",IF(TRIM(N99)<>\"\",(N99*(110*1.6))/Y99,(110*1.6)/Y99),\"\")","v":20.509665179715938},null,null,null,null,"",null,null,null,null,null,null,"$200/drum – 2 drum",null,null,null,null,null,{"$f":"IF(TRIM(N99)<>\"\",IF(VALUE(CE131)>=2,(N99)*200,\"\"),\"\")","v":""},null,null,null,null,null,null,null,null,null,null,null,null,null,null,null,null,null,null,null,null,null,null,null,null,null,null,null,null,null,null,{"$f":"MOD(N119,0.25)","v":0},null,null,null,null,null,null,null,null,875,894.03125,881.125,"",{"$f":"IF(TRIM(N100)<>\"\",CJ99*N100*0.01,\"\")","v":""}]
[null,"Mirage Stressgard",null,null,null,null,null,null,null,null,"  2 X 2.5 gal/case",null,null,null,null,null,875,null,null,null,1,null,null,null,43.56,null,null,null,null,{"$f":"IF(TRIM(Y100)<>\"\",IF(TRIM(N100)<>\"\",(N100*(5*128))/Y100,(5*128)/Y100),\"\")","v":14.692378328741965},null,null,null,null,"",null,null,null,null,null,null," $15/gal – 20 gal",null,null,null,null,null,{"$f":"IF(TRIM(N100)<>\"\",IF(VALUE(CE132)>=20,((N100)/0.2)*15,\"\"),\"\")","v":""},null,null,null,null,null,null,null,null,null,null,null,null,null,null,null,null,null,null,null,null,null,null,null,null,null,null,null,null,null,null,{"$f":"MOD(N120,0.5)","v":0},null,null,null,null,null,null,null,null,491.31,501.9959925,494.74916999999999,"",{"$f":"IF(TRIM(N102)<>\"\",N102*CJ101*0.01,\"\")","v":""}]
[null,"Nortica® 10 WP",null,null,null,null,null,null,null,null,"35 lb/bag",null,null,null,null,null,491.31,null,null,null,1.1499999999999999,null,null,null,50.094000000000001,null,null,null,null,{"$f":"IF(TRIM(Y101)<>\"\",IF(TRIM(N101)<>\"\",(N101*(35))/Y101,(35)/Y101),\"\")","v":0.6986864694374576},null,null,null,null,"",null,null,null,null,null,null," $35/bag – 5 bag",null,null,null,null,null,{"$f":"IF(TRIM(N101)<>\"\",IF(VALUE(N101)>=5,(N101)*35,\"\"),\"\")","v":""},null,null,null,null,null,null,null,null,null,null,null,null,null,null,null,null,null,null,null,null,null,null,null,null,null,null,null,null,null,null,null,null,null,null,null,null,null,null,null,825,842.94375000000002,830.77499999999998,""]
[null,{"$f":"IF(OR(CH85=1,CH85=4),\"\",\"Ronstar® FLO\")","v":"Ronstar® FLO"},null,null,null,null,null,null,null,null,{"$f":"IF(OR(CH85=1,CH85=4),\"\",\"  2 X 2.5 gal/case\")","v":"  2 X 2.5 gal/case"},null,null,null,null,null,825,null,null,null,2,null,null,null,{"$f":"IF(OR(CH85=1,CH85=4),\"\",IF(TRIM(U102)<>\"\",U102*43.56,\"\"))","v":87.12},null,null,null,null,{"$f":"IF(OR(CH85=1,CH85=4),\"\",IF(TRIM(Y102)<>\"\",IF(TRIM(N102)<>\"\",(N102*(5*128))/Y102,(5*128)/Y102),\"\"))","v":7.3461891643709825},null,null,null,null,{"$f":"IF(OR(CH85=1,CH85=4),\"\",IF(TRIM(N102)<>\"\",N102*Q102,\"\"))","v":""},null,null,null,null,null,null,{"$f":"IF(OR(CH85=1,CH85=4),\"\",\"$25/gal – 30 gal\")","v":"$25/gal – 30 gal"},null,null,null,null,null,{"$f":"IF(OR(CH85=1,CH85=4),\"\",IF(TRIM(N102)<>\"\",IF(VALUE(N102)>=6,((N102)/0.2)*25,\"\"),\"\"))","v":""},null,null,null,null,null,null,null,null,null,null,null,null,null,null,null,null,null,null,null,null,null,null,null,null,null,null,null,null,null,null,{"$f":"MOD(N124,0.25)","v":0},null,null,null,null,null,null,null,null,1980,2023.0650000000001,1993.86,"",{"$f":"IF(TRIM(N103)<>\"\",CJ102*N103*0.01,\"\")","v":""}]
[null,"Tartan Stressgard",null,null,null,null,null,null,null,null,"  2 X 2.5 gal/case",null,null,null,null,null,1980,null,null,null,2,null,null,null,87.12,null,null,null,null,{"$f":"IF(TRIM(Y103)<>\"\",IF(TRIM(N103)<>\"\",(N103*(5*128))/Y103,(5*128)/Y103),\"\")","v":7.3461891643709825},null,null,null,null,"",null,null,null,null,null,null,"$50/gal – 20 gal",null,null,null,null,null,{"$f":"IF(TRIM(N103)<>\"\",IF(VALUE(CE135)>=20,((N103)/0.2)*50,\"\"),\"\")","v":""},null,null,null,null,null,null,null,null,null,null,null,null,null,null,null,null,null,null,null,null,null,null,null,null,null,null,null,null,null,null,{"$f":"MOD(N130,0.5)","v":0},null,null,null,null,null,null,null,null,125,127.49999999999999,0,"",{"$f":"IF(TRIM(N105)<>\"\",N105*CJ104*0.01,\"\")","v":""}]
[null,{"$f":"IF(OR(CH85=1,CH85=4),\"\",\"TopChoice® (20+ bags)\")","v":"TopChoice® (20+ bags)"},null,null,null,null,null,null,null,null,{"$f":"IF(OR(CH85=1,CH85=4),\"\",\"50 lb/bag\")","v":"50 lb/bag"},null,null,null,null,null,{"$f":"IF(OR(CH85=1,CH85=4),\"\",IF($CH$85=1,CL103,IF($CH$85=2,CK103,CJ103)))","v":125},null,null,null,2,null,null,null,{"$f":"IF(OR(CH85=1,CH85=4),\"\",IF(TRIM(U104)<>\"\",U104*43.56,\"\"))","v":87.12},null,null,null,null,{"$f":"IF(OR(CH85=1,CH85=4),\"\",IF(TRIM(Y104)<>\"\",IF(TRIM(N104)<>\"\",(N104*(50))/Y104,(50)/Y104),\"\"))","v":0.57392102846648296},null,null,null,null,{"$f":"IF(OR(CH85=1,CH85=4),\"\",IF(CH85=1,\"\",IF(TRIM(N104)<>\"\",N104*Q104,\"\")))","v":""},null,null,null,null,null,null,{"$f":"IF(OR(CH85=1,CH85=4),\"\",\"$20/bag – 20 bag\")","v":"$20/bag – 20 bag"},null,null,null,null,null,{"$f":"IF(OR(CH85=1,CH85=4),\"\",IF(TRIM(N104)<>\"\",IF(VALUE(N104)>=20,(N104)*20,\"\"),\"\"))","v":""},null,null,null,null,null,null,null,null,null,null,null,null,null,null,null,null,null,null,null,null,null,null,null,null,null,null,null,null,null,null,null,null,null,null,null,null,null,null,null,137.5,140.5,0,""]
[null,{"$f":"IF(OR(CH85=1,CH85=4),\"\",\"TopChoice® (1-19 bags)\")","v":"TopChoice® (1-19 bags)"},null,null,null,null,null,null,null,null,{"$f":"IF(OR(CH85=1,CH85=4),\"\",\"50 lb/bag\")","v":"50 lb/bag"},null,null,null,null,null,{"$f":"IF(OR(CH85=1,CH85=4),\"\",IF($CH$85=1,CL104,IF($CH$85=2,CK104,CJ104)))","v":137.5},null,null,null,2,null,null,null,{"$f":"IF(OR(CH85=1,CH85=4),\"\",IF(TRIM(U105)<>\"\",U105*43.56,\"\"))","v":87.12},null,null,null,null,{"$f":"IF(OR(CH85=1,CH85=4),\"\",IF(TRIM(Y105)<>\"\",IF(TRIM(N105)<>\"\",(N105*50)/Y105,50/Y105),\"\"))","v":0.57392102846648296},null,null,null,null,{"$f":"IF(OR(CH85=1,CH85=4),\"\",IF(TRIM(N105)<>\"\",N105*Q105,\"\"))","v":""},null,null,null,null,null,null,{"$f":"IF(OR(CH85=1,CH85=4),\"\",\"$10/bag\")","v":"$10/bag"},null,null,null,null,null,{"$f":"IF(OR(CH85=1,CH85=4),\"\",IF(TRIM(N105)<>\"\",(N105)*10,\"\"))","v":""},null,null,null,null,null,null,null,null,null,null,null,null,null,null,null,null,null,null,null,null,null,null,null,null,null,null,null,null,null,null,null,null,null,null,null,null,null,null,null,625,{"$f":"CJ105 + (CJ105*0.02175)","v":638.59375},{"$f":"CJ105 + (CJ105*0.007)","v":629.375},{"$f":"IF(TRIM(AI106)<>\"\",N106*CJ105,\"\")","v":""},{"$f":"IF(TRIM(AI106)<>\"\",CJ105*N106*0.01,\"\")","v":""}]
[null,{"$f":"IF(CH85=2,\"\",\"Signature XTRA Stressgard\")","v":"Signature XTRA Stressgard"},null,null,null,null,null,null,null,null,{"$f":"IF(CH85=2,\"\",\"4 X 5.5 lbs/case\")","v":"4 X 5.5 lbs/case"},null,null,null,null,null,{"$f":"IF($CH$85=1,CL105,IF($CH$85=2,\"\",CJ105))","v":625},null,null,null,4,null,null,null,{"$f":"IF(CH85=2,\"\",IF(TRIM(U106)<>\"\",U106*43.56,\"\"))","v":174.24},null,null,null,null,{"$f":"IF(CH85=2,\"\",IF(TRIM(Y106)<>\"\",IF(TRIM(N106)<>\"\",(N106*(44*16))/Y106,(44*16)/Y106),\"\"))","v":4.0404040404040398},null,null,null,null,{"$f":"IF(CH85=2,\"\",IF(TRIM(N106)<>\"\",N106*Q106,\"\"))","v":""},null,null,null,null,null,null,null,null,null,null,null,null,null,null,null,null,null,null,null,null,null,null,null,null,null,null,null,null,null,null,null,null,null,null,null,null,null,null,null,null,null,null,null,null,null,null,null,null,null,null,null,null,1133.25,1157.8981874999999,1141.1827499999999,{"$f":"IF(TRIM(N107)<>\"\",N107*CJ106,\"\")","v":""},{"$f":"IF(TRIM(N107)<>\"\",CJ106*N107*0.01,\"\")","v":""}]
[null,{"$f":"IF(CH85=2,\"Chipco Signature\",CONCATENATE(\"Chipco Signature\",\"™\"))","v":"Chipco Signature™"},null,null,null,null,null,null,null,null,"8 X 5.5 lbs/case",null,null,null,null,null,{"$f":"IF($CH$85=1,CL106,IF($CH$85=2,CK106,CJ106))","v":1133.25},null,null,null,4,null,null,null,{"$f":"IF(TRIM(U107)<>\"\",U107*43.56,\"\")","v":174.24},null,null,null,null,{"$f":"IF(TRIM(Y107)<>\"\",IF(TRIM(N107)<>\"\",(N107*(44*16))/Y107,(44*16)/Y107),\"\")","v":4.0404040404040398},null,null,null,null,{"$f":"IF(TRIM(N107)<>\"\",N107*Q107,\"\")","v":""},null,null,null,null,null,null,null,null,null,null,null,null,null,null,null,null,null,null,null,null,null,null,null,null,null,null,null,null,null,null,null,null,null,null,null,null,null,null,null,null,null,null,null,null,null,null,null,null,null,null,null,null,2240,2288.7199999999998,2255.6799999999998,""]
[null,{"$f":"IF(OR(CH85=1,CH85=4),\"\",\"Revolver®\")","v":"Revolver®"},null,null,null,null,null,null,null,null,{"$f":"IF(OR(CH85=1,CH85=4),\"\",\"4 X 87 oz/case\")","v":"4 X 87 oz/case"},null,null,null,null,null,{"$f":"IF(OR(CH85=1,CH85=4),\"\",IF($CH$85=1,CL107,IF($CH$85=2,CK107,CJ107)))","v":2240},null,null,null,0.4,null,null,null,{"$f":"IF(OR(CH85=1,CH85=4),\"\",IF(TRIM(U108)<>\"\",U108*43.56,\"\"))","v":17.424000000000003},null,null,null,null,{"$f":"IF(OR(CH85=1,CH85=4),\"\",IF(TRIM(Y108)<>\"\",IF(TRIM(N108)<>\"\",(N108*(4*87))/Y108,(4*87)/Y108),\"\"))","v":19.972451790633606},null,null,null,null,{"$f":"IF(OR(CH85=1,CH85=4),\"\",IF(TRIM(N108)<>\"\",N108*Q108,\"\"))","v":""},null,null,null,null,null,null,null,null,null,null,null,null,null,null,null,null,null,null,null,null,null,null,null,null,null,null,null,null,null,null,null,null,null,null,null,null,null,null,null,null,null,null,null,null,null,null,null,null,null,null,null,null,2880,2942.64,2900.16,""]
[null,"Specticle FLO (14+ gal)",null,null,null,null,null,null,null,null,"2 X 1 gal/case",null,null,null,null,null,2880,null,null,null,0.1492,null,null,null,{"$f":"IF(TRIM(U109)<>\"\",U109*43.56,\"\")","v":6.4991520000000005},null,null,null,null,{"$f":"IF(TRIM(Y109)<>\"\",IF(TRIM(N109)<>\"\",(N109*(2*128))/Y109,(2*128)/Y109),\"\")","v":39.389754232552185},null,null,null,null,{"$f":"IF(TRIM(N109)<>\"\",N109*Q109,\"\")","v":""},null,null,null,null,null,null,null,null,null,null,null,null,null,null,null,null,null,null,null,null,null,null,null,null,null,null,null,null,null,null,null,null,null,null,null,null,null,null,null,null,null,null,null,null,null,null,null,null,null,null,null,null,3150,3218.5124999999998,3172.05,""]
[null,"Specticle FLO (1-13 gal)",null,null,null,null,null,null,null,null,"2 X 1 gal/case",null,null,null,null,null,3150,null,null,null,0.1492,null,null,null,6.4991520000000005,null,null,null,null,{"$f":"IF(TRIM(Y110)<>\"\",IF(TRIM(N110)<>\"\",(N110*(2*128))/Y110,(2*128)/Y110),\"\")","v":39.389754232552185},null,null,null,null,"",null,null,null,null,null,null,null,null,null,null,null,null,null,null,null,null,null,null,null,null,null,null,null,null,null,null,null,null,null,null,null,null,null,null,null,null,null,null,null,null,null,null,null,null,null,null,null,null,null,null,null,null,1816,1855.498,1828.712,""]
[null,"Specticle FLO",null,null,null,null,null,null,null,null,"8 X 18 oz/case",null,null,null,null,null,1816,null,null,null,0.1492,null,null,null,6.4991520000000005,null,null,null,null,{"$f":"IF(TRIM(Y111)<>\"\",IF(TRIM(N111)<>\"\",(N111*(8*18))/Y111,(8*18)/Y111),\"\")","v":22.156736755810602},null,null,null,null,"",null,null,null,null,null,null,null,null,null,null,null,null,null,null,null,null,null,null,null,null,null,null,null,null,null,null,null,null,null,null,null,null,null,null,null,null,null,null,null,null,null,null,null,null,null,null,null,null,null,null,null,null,91,92.979249999999993,91.637,""]
[null,"Specticle G",null,null,null,null,null,null,null,null,"50 lb/bag",null,null,null,null,null,91,null,null,null,4.5913680000000001,null,null,null,199.99999008,null,null,null,null,{"$f":"IF(TRIM(Y112)<>\"\",IF(TRIM(N112)<>\"\",(N112*(50))/Y112,(50)/Y112),\"\")","v":0.25000001240000064},null,null,null,null,"",null,null,null,null,null,null,"$5/bag –- 40 bag",null,null,null,null,null,{"$f":"IF(TRIM(N112)<>\"\",IF(VALUE(N112)>=40,(N112)*5,\"\"),\"\")","v":""},null,null,null,null,null,null,null,null,null,null,null,null,null,null,null,null,null,null,null,null,null,null,null,null,null,null,null,null,null,null,null,null,null,null,null,null,null,null,null,332.42,339.65013500000003,334.74694,"",null,null,null,null,null,null,null,null,null,null,"Agency Case goods","In season","Rate","A",null,null,null,null,null,null,null,null,null,null,null,null,null,null,null,null,null,null,null,null,null,null,null,null,"Select Rebates - Cool Season"]
[null,{"$f":"IF(OR(CH85=1,CH85=4),\"\",\"Tribute Total\")","v":"Tribute Total"},null,null,null,null,null,null,null,null,{"$f":"IF(OR(CH85=1,CH85=4),\"\",\"6 oz/bottle\")","v":"6 oz/bottle"},null,null,null,null,null,{"$f":"IF(OR(CH85=1,CH85=4),\"\",IF($CH$85=1,CL112,IF($CH$85=2,CK112,CJ112)))","v":332.42},null,null,null,7.0000000000000007E-2,null,null,null,{"$f":"IF(OR(CH85=1,CH85=4),\"\",IF(TRIM(U113)<>\"\",U113*43.56,\"\"))","v":3.0492000000000004},null,null,null,null,{"$f":"IF(OR(CH85=1,CH85=4),\"\",IF(TRIM(Y113)<>\"\",IF(TRIM(N113)<>\"\",(N113*6)/Y113,6/Y113),\"\"))","v":1.967729240456513},null,null,null,null,{"$f":"IF(OR(CH85=1,CH85=4),\"\",IF(TRIM(N113)<>\"\",N113*Q113,\"\"))","v":""},null,null,null,null,null,null,null,null,null,null,null,null,null,null,null,null,null,null,null,null,null,null,null,null,null,null,null,null,null,null,null,null,null,null,null,null,null,null,null,null,null,null,null,null,null,null,null,null,null,null,null,null,null,null,null,null,null,null,null,null,null,null,null,null,null,null,null,null,null,null,null,0.09,0.08,7.0000000000000007E-2,6.0000000000000005E-2,0.05,0.04,0.03,0.02,0,null,"Herbicide Pak with Rebate","Greens Pak with Rebate","Fairy Ring Pak","Bermuda Solutions pak with Rebate","Pythium Pak","Leaf Spot Pak",null,"Select Rebates"]
[null,"     NON-AGENCY PRODUCTS",null,null,null,null,null,null,null,null,null,null,null,null,null,null,null,null,null,null,null,null,null,null,null,null,null,null,null,null,null,null,null,null,null,null,null,null,null,null,null,null,null,null,null,null,null,null,null,null,null,null,null,null,null,null,null,null,null,null,null,null,null,null,null,null,null,null,null,null,null,null,null,null,null,null,null,null,null,null,null,null,null,null,null,null,null,null,null,null,{"$f":"IF(TRIM(N115)<>\"\",N115*Q115,\"\")","v":""},null,null,null,null,null,null,null,null,null,null,null,null,null,null,null,null,null,null,null,null,null,null,null,null,null,null,null,null,null,null,null,null,null,null,null,null,null,null,"Products","Packing",null,"Rate","Price","Rebate","Case Cost W/Select & EOP Rebate","oz/A","A/case","Cost/A","Cost per Case with EOP rebate applied","Cost/A with EOP rebate applied"]
[null,"26GT",null,null,null,null,null,null,null,null,"  2 X 2.5 gal/case",null,null,null,null,null,null,null,null,null,4,null,null,null,{"$f":"IF(TRIM(U115)<>\"\",U115*43.56,\"\")","v":174.24},null,null,null,null,{"$f":"IF(TRIM(Y115)<>\"\",IF(TRIM(N115)<>\"\",(N115*(5*128))/Y115,(5*128)/Y115),\"\")","v":3.6730945821854912},null,null,null,null,{"$f":"IF(AND(TRIM(N115)<>\"\",TRIM(Q115)<>\"\"),N115*Q115,\"\")","v":""},null,null,null,null,null,null,"  $20/gal – 40 gal",null,null,null,null,null,{"$f":"IF(AND(TRIM(N115)<>\"\",TRIM(Q115)<>\"\"),IF(VALUE(CE146)>=40,((N115)/0.2)*20,\"\"),\"\")","v":""},null,null,null,null,null,null,null,null,null,null,null,null,null,null,null,null,null,null,null,null,null,null,null,null,null,null,null,null,null,null,null,null,null,null,null,null,null,null,null,null,null,null,""]
[null,"Compass®",null,null,null,null,null,null,null,null,"20 X 8 oz/drum",null,null,null,null,null,null,null,null,null,0.25,null,null,null,{"$f":"IF(TRIM(U116)<>\"\",U116*43.56,\"\")","v":10.89},null,null,null,null,{"$f":"IF(TRIM(Y116)<>\"\",IF(TRIM(N116)<>\"\",(N116*(20*8))/Y116,(20*8)/Y116),\"\")","v":14.692378328741965},null,null,null,null,{"$f":"IF(AND(TRIM(N116)<>\"\",TRIM(Q116)<>\"\"),N116*Q116,\"\")","v":""},null,null,null,null,null,null,"$50lb – 8 lb",null,null,null,null,null,{"$f":"IF(AND(TRIM(N116)<>\"\",TRIM(Q116)<>\"\"),IF((VALUE(CE148))>=8,(((VALUE(N116))*10))*50,\"\"),\"\")","v":""},null,null,null,null,null,null,null,null,null,null,null,null,null,null,null,null,null,null,null,null,null,null,null,null,null,null,null,null,null,null,null,null,null,null,null,null,null,null,null,null,null,null,"",null,null,null,null,null,null,null,null,null,4,"Chipco Choice",{"$f":"CJ95","v":220},0.55000000000000004,{"$f":"50/($CY$151*CZ116)","v":2.0869855580599381},null,{"$f":"($CY$116/$DA$116)*0.91","v":95.927831999999995},{"$f":"($CY$116/$DA$116)*0.92","v":96.981983999999997},{"$f":"($CY$116/$DA$116)*0.93","v":98.036135999999999},{"$f":"($CY$116/$DA$116)*0.94","v":99.090287999999987},{"$f":"($CY$116/$DA$116)*0.95","v":100.14443999999999},{"$f":"($CY$116/$DA$116)*0.96","v":101.19859199999999},{"$f":"($CY$116/$DA$116)*0.97","v":102.25274399999999},{"$f":"($CY$116/$DA$116)*0.98","v":103.30689599999999},{"$f":"CY116/DA116","v":105.4152},null,"NA","NA","NA","NA","NA","NA",null,{"$f":"EK121","v":{"$error":"#VALUE!"}},{"$f":"EL121","v":220}]
[null,"Compass",null,null,null,null,null,null,null,null,"4 X 1 lb/case",null,null,null,null,null,null,null,null,null,0.25,null,null,null,10.89,null,null,null,null,{"$f":"IF(TRIM(Y117)<>\"\",IF(TRIM(N117)<>\"\",(N117*(64))/Y117,(64)/Y117),\"\")","v":5.8769513314967856},null,null,null,null,"",null,null,null,null,null,null,"$50lb – 8 lb",null,null,null,null,null,{"$f":"IF(AND(TRIM(N117)<>\"\",TRIM(Q117)<>\"\"),IF((VALUE(CE149))>=8,(((VALUE(N117))*4))*50,\"\"),\"\")","v":""},null,null,null,null,null,null,null,null,null,null,null,null,null,null,null,null,null,null,null,null,null,null,null,null,null,null,null,null,null,null,null,null,null,null,null,null,null,null,null,null,null,null,"",null,null,null,null,null,null,null,null,null,null,"Ronstar FLO",{"$f":"CJ101","v":825},{"$f":"$U$102","v":2},{"$f":"640/($CY$151*CZ117)","v":7.3461891643709825},null,{"$f":"($CY$117/$DA$117)*0.91","v":102.19584374999999},{"$f":"($CY$117/$DA$117)*0.92","v":103.31887500000001},{"$f":"($CY$117/$DA$117)*0.93","v":104.44190625},{"$f":"($CY$117/$DA$117)*0.94","v":105.56493749999998},{"$f":"($CY$117/$DA$117)*0.95","v":106.68796875},{"$f":"($CY$117/$DA$117)*0.96","v":107.81099999999999},{"$f":"($CY$117/$DA$117)*0.97","v":108.93403124999999},{"$f":"($CY$117/$DA$117)*0.98","v":110.05706249999999},112.30312499999999,null,"NA","NA","NA","NA","NA","NA",null,{"$f":"EI122","v":{"$error":"#VALUE!"}},{"$f":"EL122","v":108.9}]
[null,{"$f":"IF(CH85=4,\"\",\"ProStar 70 WG\")","v":"ProStar 70 WG"},null,null,null,null,null,null,null,null,{"$f":"IF(CH85=4,\"\",\"4 X 3 lb/case\")","v":"4 X 3 lb/case"},null,null,null,null,null,null,null,null,null,2.2000000000000002,null,null,null,{"$f":"IF(CH85=4,\"\",IF(TRIM(U118)<>\"\",U118*43.56,\"\"))","v":95.832000000000008},null,null,null,null,{"$f":"IF(CH85=4,\"\",IF(TRIM(Y118)<>\"\",IF(TRIM(N118)<>\"\",(N118*192)/Y118,192/Y118),\"\"))","v":2.0035061357375405},null,null,null,null,{"$f":"IF(CH85=4,\"\",IF(AND(TRIM(N118)<>\"\",TRIM(Q118)<>\"\"),N118*Q118,\"\"))","v":""},null,null,null,null,null,null,{"$f":"IF(CH85=4,\"\",\"$3 lb – 24 lb\")","v":"$3 lb – 24 lb"},null,null,null,null,null,{"$f":"IF(CH85=4,\"\",IF(AND(TRIM(N118)<>\"\",TRIM(Q118)<>\"\"),IF((VALUE(CE150))>=24,((VALUE(N118))*12)*3,\"\"),\"\"))","v":""},null,null,null,null,null,null,null,null,null,null,null,null,null,null,null,null,null,null,null,null,null,null,null,null,null,null,null,null,null,null,null,null,null,null,null,null,null,null,null,null,null,null,"",null,null,null,null,null,null,null,null,null,null,"Specticle FLO 2x1(>=14)",{"$f":"CJ108","v":2880},{"$f":"$U$109","v":0.1492},{"$f":"256/($CY$151*CZ118)","v":39.389754232552185},null,{"$f":"($CY$118/$DA$118)*0.91","v":66.535068600000002},{"$f":"($CY$118/$DA$118)*0.92","v":67.266223199999999},{"$f":"($CY$118/$DA$118)*0.93","v":67.99737780000001},{"$f":"($CY$118/$DA$118)*0.94","v":68.728532399999992},{"$f":"($CY$118/$DA$118)*0.95","v":69.459687000000002},{"$f":"($CY$118/$DA$118)*0.96","v":70.190841599999999},{"$f":"($CY$118/$DA$118)*0.97","v":70.921996199999995},{"$f":"($CY$118/$DA$118)*0.98","v":71.653150799999992},73.115459999999999,null,"NA","NA","NA","NA","NA","NA",null,"NA"]
[null,{"$f":"IF(CH85=2,\"\",\"Acclaim® Extra\")","v":"Acclaim® Extra"},null,null,null,null,null,null,null,null,{"$f":"IF(CH85=2,\"\",\"4 X 1 gal/case\")","v":"4 X 1 gal/case"},null,null,null,null,null,null,null,null,null,0.5,null,null,null,{"$f":"IF(CH85=2,\"\",IF(TRIM(U119)<>\"\",U119*43.56,\"\"))","v":21.78},null,null,null,null,{"$f":"IF(CH85=2,\"\",IF(TRIM(Y119)<>\"\",IF(TRIM(N119)<>\"\",(N119*(4*128))/Y119,(4*128)/Y119),\"\"))","v":23.507805325987142},null,null,null,null,{"$f":"IF(CH85=2,\"\",IF(AND(TRIM(N119)<>\"\",TRIM(Q119)<>\"\"),N119*Q119,\"\"))","v":""},null,null,null,null,null,null,{"$f":"IF(CH85=2,\"\",\"$90/gal\")","v":"$90/gal"},null,null,null,null,null,{"$f":"IF(CH85=2,\"\",IF(AND(TRIM(N119)<>\"\",TRIM(Q119)<>\"\"),IF(VALUE(N119)>=0.25,((N119)/0.25)*90,\"\"),\"\"))","v":""},null,null,null,null,null,null,null,null,null,null,null,null,null,null,null,null,null,null,null,null,null,null,null,null,null,null,null,null,null,null,null,null,null,null,null,null,null,null,null,null,null,null,"",{"$f":"IF((AND(TRIM(N120)<>\"\",TRIM(Q120)<>\"\")),CJ105*N120*0.01,\"\")","v":""},null,null,null,null,null,null,null,null,null,"Specticle FLO 2x1(<14)",{"$f":"CJ109","v":3150},{"$f":"$U$110","v":0.1492},{"$f":"256/($CY$151*CZ119)","v":39.389754232552185},null,{"$f":"($CY119/$DA119)*0.91","v":72.772731281250003},{"$f":"($CY119/$DA119)*0.92","v":73.572431625000007},{"$f":"($CY119/$DA119)*0.93","v":74.372131968749997},{"$f":"($CY119/$DA119)*0.94","v":75.171832312499987},{"$f":"($CY119/$DA119)*0.95","v":75.971532656249991},{"$f":"($CY119/$DA119)*0.96","v":76.771232999999995},{"$f":"($CY119/$DA119)*0.97","v":77.570933343749999},{"$f":"($CY119/$DA119)*0.98","v":78.370633687499989},79.970034374999997,null,0,"NA","NA","NA","NA","NA",null,"NA",null,null,null,null,null,null,null,null,null,null,null,null,null,null,null,null,null,0]
[null,"Chipco Signature",null,null,null,null,null,null,null,null,"  4 X 5.5 lbs/case",null,null,null,null,null,null,null,null,null,4,null,null,null,174.24,null,null,null,null,{"$f":"IF(TRIM(Y120)<>\"\",IF(TRIM(N120)<>\"\",(N120*(22*16))/Y120,(22*16)/Y120),\"\")","v":2.0202020202020199},null,null,null,null,"",null,null,null,null,null,null,null,null,null,null,null,null,null,null,null,null,null,null,null,null,null,null,null,null,null,null,null,null,null,null,null,null,null,null,null,null,null,null,null,null,null,null,null,null,null,null,null,null,null,null,null,null,null,null,null,"",null,null,null,null,null,null,null,null,null,null,"Tribute Total",{"$f":"CJ112","v":332.42},{"$f":"$U$113","v":7.0000000000000007E-2},{"$f":"6/($CY$151*CZ120)","v":1.967729240456513},null,{"$f":"($CY120/$DA120)*0.91","v":153.73161804000003},{"$f":"($CY120/$DA120)*0.92","v":155.42097648000004},{"$f":"($CY120/$DA120)*0.93","v":157.11033492000004},{"$f":"($CY120/$DA120)*0.94","v":158.79969336000002},{"$f":"($CY120/$DA120)*0.95","v":160.48905180000003},{"$f":"($CY120/$DA120)*0.96","v":162.17841024000003},{"$f":"($CY120/$DA120)*0.97","v":163.86776868000004},{"$f":"($CY120/$DA120)*0.98","v":165.55712712000002},168.93584400000003,null,0,"NA","NA","NA","NA","NA",null,"NA",null,null,null,null,null,"Celsius WG","8x10oz",80,{"$f":"$U$95","v":8.5000000000000006E-2},{"$f":"CY123","v":769.6},15,{"$f":"(ED120-(ED120*$ED$140))-EE120","v":{"$error":"#VALUE!"}},{"$f":"($EJ$140*EC120)","v":3.7026000000000003},{"$f":"(EB120/EG120)","v":21.606438718738183},{"$f":"(EF120/EH120)","v":{"$error":"#VALUE!"}},{"$f":"(ED120-(ED120*$ED$140))","v":{"$error":"#VALUE!"}},{"$f":"EJ120/EH120","v":{"$error":"#VALUE!"}},{"$f":"ED120/EH120","v":35.619012000000005}]
[null,{"$f":"IF(CH85=2,\"\",\"Dylox® 420 SL\")","v":"Dylox® 420 SL"},null,null,null,null,null,null,null,null,{"$f":"IF(CH85=2,\"\",\"2 X 2.5 gal/case\")","v":"2 X 2.5 gal/case"},null,null,null,null,null,null,null,null,null,6.9,null,null,null,300.56400000000002,null,null,null,null,{"$f":"IF(TRIM(Y121)<>\"\",IF(TRIM(N121)<>\"\",(N121*(5*128))/Y121,(5*128)/Y121),\"\")","v":2.1293301925712993},null,null,null,null,{"$f":"IF(CH85=2,\"\",IF(AND(TRIM(N121)<>\"\",TRIM(Q121)<>\"\"),N121*Q121,\"\"))","v":""},null,null,null,null,null,null,null,null,null,null,null,null,null,null,null,null,null,null,null,null,null,null,null,null,null,null,null,null,null,null,null,null,null,null,null,null,null,null,null,null,null,null,null,null,null,null,null,null,null,null,null,null,null,null,null,"",null,null,null,null,null,null,null,null,null,null,"Topchoice (>=20)",{"$f":"CJ103","v":125},{"$f":"$U$104","v":2},{"$f":"600/($CY$151*CZ121)","v":6.887052341597796},null,{"$f":"($CY121/$DA121)*0.91","v":16.516500000000004},{"$f":"($CY121/$DA121)*0.92","v":16.698000000000004},{"$f":"($CY121/$DA121)*0.93","v":16.879500000000004},{"$f":"($CY121/$DA121)*0.94","v":17.061},{"$f":"($CY121/$DA121)*0.95","v":17.2425},{"$f":"($CY121/$DA121)*0.96","v":17.424000000000003},{"$f":"($CY121/$DA121)*0.97","v":17.605500000000003},{"$f":"($CY121/$DA121)*0.98","v":17.787000000000003},18.150000000000002,null,"NA","NA","NA","NA","NA",{"$f":"EI123","v":{"$error":"#VALUE!"}},null,{"$f":"EI123","v":{"$error":"#VALUE!"}},{"$f":"EL123","v":18.150000000000002},null,null,null,null,"Chipco Choice",50,50,0.58750000000000002,220,10,{"$f":"(ED121-(ED121*$ED$140))-EE121","v":{"$error":"#VALUE!"}},null,null,null,null,{"$f":"EF121","v":{"$error":"#VALUE!"}},220]
[null,"Forbid®",null,null,null,null,null,null,null,null," 6 X 8 oz/case",null,null,null,null,null,null,null,null,null,null,null,null,null,null,null,null,null,null,null,null,null,null,null,{"$f":"IF(AND(TRIM(N122)<>\"\",TRIM(Q122)<>\"\"),N122*Q122,\"\")","v":""},null,null,null,null,null,null,null,null,null,null,null,null,null,null,null,null,null,null,null,null,null,null,null,null,null,null,null,null,null,null,null,null,null,null,null,null,null,null,null,null,null,null,null,null,null,"Calc SR min with PAK components",null,null,null,null,null,null,null,null,null,"",null,null,null,null,null,null,null,null,null,null,"Topchoice (<20)",{"$f":"CJ104","v":137.5},{"$f":"$U$105","v":2},{"$f":"600/($CY$151*CZ122)","v":6.887052341597796},null,18.168150000000001,18.367799999999999,18.567450000000001,18.767099999999999,18.966749999999998,19.166399999999999,19.366049999999998,19.5657,19.965,null,"NA","NA","NA","NA","NA","NA",null,{"$f":"EI124","v":{"$error":"#VALUE!"}},{"$f":"EL124","v":19.965},null,null,null,null,"Ronstar FLO","2x2.5gal",640,{"$f":"$U$102","v":2},800,100,{"$f":"(ED122-(ED122*$ED$140))-EE122","v":{"$error":"#VALUE!"}},{"$f":"($EJ$140*EC122)","v":87.12},{"$f":"(EB122/EG122)","v":7.3461891643709825},{"$f":"(EF122/EH122)","v":{"$error":"#VALUE!"}},{"$f":"(ED122-(ED122*$ED$140))","v":{"$error":"#VALUE!"}},{"$f":"EJ122/EH122","v":{"$error":"#VALUE!"}},{"$f":"ED122/EH122","v":108.9}]
[null,"Proxy®",null,null,null,null,null,null,null,null,"  2 X 2.5 gal/case",null,null,null,null,null,null,null,null,null,5,null,null,null,{"$f":"IF(TRIM(U123)<>\"\",U123*43.56,\"\")","v":217.8},null,null,null,null,{"$f":"IF(TRIM(Y123)<>\"\",IF(TRIM(N123)<>\"\",(N123*(5*128))/Y123,(5*128)/Y123),\"\")","v":2.9384756657483928},null,null,null,null,{"$f":"IF(AND(TRIM(N123)<>\"\",TRIM(Q123)<>\"\"),N123*Q123,\"\")","v":""},null,null,null,null,null,null,null,null,null,null,null,null,null,null,null,null,null,null,null,null,null,null,null,null,null,null,null,null,null,null,null,null,null,null,null,null,null,null,null,null,null,null,null,null,null,"Single Unit","PAK Unit","Total",null,null,null,null,null,null,null,"",null,null,null,null,null,null,null,null,null,null,"Celsius WG",{"$f":"CJ94","v":769.6},{"$f":"$U$95","v":8.5000000000000006E-2},{"$f":"80/($CY$151*CZ123)","v":21.606438718738183},null,32.413300920000005,32.769491040000005,33.125681160000006,33.48187128,33.838061400000001,34.194251520000002,34.550441640000003,34.906631760000003,35.619012000000005,null,"NA","NA","NA","NA","NA",{"$f":"EI120","v":{"$error":"#VALUE!"}},null,{"$f":"EI120","v":{"$error":"#VALUE!"}},{"$f":"EL120","v":35.619012000000005},null,null,null,null,"Topchoice",50,600,{"$f":"$U$104","v":2},125,20,{"$f":"(ED123-(ED123*$ED$140))-EE123","v":{"$error":"#VALUE!"}},{"$f":"($EJ$140*EC123)","v":87.12},6.887052341597796,{"$error":"#VALUE!"},{"$error":"#VALUE!"},{"$error":"#VALUE!"},18.150000000000002]
[null,{"$f":"IF(OR(CH85=1,CH85=4),\"\",\"Revolver\")","v":"Revolver"},null,null,null,null,null,null,null,null,{"$f":"IF(OR(CH85=1,CH85=4),\"\",\"4 X 32 oz/case\")","v":"4 X 32 oz/case"},null,null,null,null,null,null,null,null,null,0.4,null,null,null,{"$f":"IF(OR(CH85=1,CH85=4),\"\",IF(TRIM(U124)<>\"\",U124*43.56,\"\"))","v":17.424000000000003},null,null,null,null,{"$f":"IF(OR(CH85=1,CH85=4),\"\",IF(TRIM(Y124)<>\"\",IF(TRIM(N124)<>\"\",(N124*128)/Y124,128/Y124),\"\"))","v":7.3461891643709816},null,null,null,null,{"$f":"IF(OR(CH85=1,CH85=4),\"\",IF(AND(TRIM(N124)<>\"\",TRIM(Q124)<>\"\"),N124*Q124,\"\"))","v":""},null,null,null,null,null,null,null,null,null,null,null,null,null,null,null,null,null,null,null,null,null,null,null,null,null,null,null,null,null,null,null,null,null,null,null,null,null,null,null,null,null,null,null,null,null,{"$f":"N93*5","v":0},{"$f":"(AP79*4)+(AP87*6)+(AP82*4)","v":0},{"$f":"SUM(CC124:CD124)","v":0},null,null,null,null,null,null,null,"",null,null,null,null,null,null,null,null,null,null,"Revolver",{"$f":"CJ107","v":2240},{"$f":"$U$108","v":0.4},{"$f":"348/($CY$151*CZ124)","v":19.972451790633606},null,102.06057931034485,103.18212413793105,104.30366896551726,105.42521379310345,106.54675862068966,107.66830344827586,108.78984827586208,109.91139310344829,112.1544827586207,null,"NA","NA","NA","NA","NA","NA",null,"NA",null,null,null,null,null,"Topchoice",50,600,{"$f":"$U$104","v":2},137.5,10,{"$f":"(ED124-(ED124*$ED$140))-EE124","v":{"$error":"#VALUE!"}},{"$f":"($EJ$140*EC124)","v":87.12},{"$f":"(EB124/EG124)","v":6.887052341597796},{"$f":"(EF124/EH124)","v":{"$error":"#VALUE!"}},{"$f":"(ED124-(ED124*$ED$140))","v":{"$error":"#VALUE!"}},{"$f":"EJ124/EH124","v":{"$error":"#VALUE!"}},{"$f":"ED124/EH124","v":19.965}]
[null,"Prograss®",null,null,null,null,null,null,null,null,"  2 X 2.5 gal/case",null,null,null,null,null,null,null,null,null,1.5,null,null,null,{"$f":"IF(TRIM(U125)<>\"\",U125*43.56,\"\")","v":65.34},null,null,null,null,{"$f":"IF(TRIM(Y125)<>\"\",IF(TRIM(N125)<>\"\",(N125*(5*128))/Y125,(5*128)/Y125),\"\")","v":9.7949188858279754},null,null,null,null,"",null,null,null,null,null,null,null,null,null,null,null,null,null,null,null,null,null,null,null,null,null,null,null,null,null,null,null,null,null,null,null,null,null,null,null,null,null,null,null,null,null,null,null,null,null,null,null,null,null,null,null,null,null,null,null,"",null,null,null,null,null,null,null,null,null,null,null,null,null,null,null,null,null,null,null,null,null,null,null,null,null,null,null,null,null,null,null,null,null,null,null,null,null,null,"Banol","2 x 2.5gal",640,{"$f":"$U$93","v":2},1850,300,{"$f":"(ED125-(ED125*$ED$140))-EE125","v":{"$error":"#VALUE!"}},{"$f":"($EJ$140*EC125)","v":87.12},{"$f":"(EB125/EG125)","v":7.3461891643709825},{"$f":"(EF125/EH125)","v":{"$error":"#VALUE!"}},{"$f":"(ED125-(ED125*$ED$140))","v":{"$error":"#VALUE!"}},{"$f":"EJ125/EH125","v":{"$error":"#VALUE!"}},{"$f":"ED125/EH125","v":251.83125000000001}]
[null,"Specticle Total",null,null,null,null,null,null,null,null,"4 x 144 oz/case",null,null,null,null,null,null,null,null,null,16,null,null,null,{"$f":"IF(TRIM(U126)<>\"\",U126*43.56,\"\")","v":696.96},null,null,null,null,{"$f":"IF(TRIM(Y126)<>\"\",IF(TRIM(N126)<>\"\",(N126*(4.5*128))/Y126,(4.5*128)/Y126),\"\")","v":0.82644628099173545},null,null,null,null,{"$f":"IF(AND(TRIM(N126)<>\"\",TRIM(Q126)<>\"\"),N126*Q126,\"\")","v":""},null,null,null,null,null,null,null,null,null,null,null,null,null,null,null,null,null,null,null,null,null,null,null,null,null,null,null,null,null,null,null,null,null,null,null,null,null,null,null,null,null,null,null,0.17,{"$f":"IF(TRIM($N$109)<>\"\",IF($N$109-(INT($N$109))=CA126,1,\"\"),\"\")","v":""},{"$f":"N94*5","v":0},{"$f":"(AP79*5)+(AP80*5)+(AP81*5)","v":0},{"$f":"SUM(CC126:CD126)","v":0},null,null,null,null,null,null,null,null,null,null,null,null,null,null,null,null,null,null,null,null,null,null,null,null,null,null,null,null,null,null,null,null,null,"SP With Rebate","Ess Pak With Rebate","Greens Pak with Rebate","Fairway Pak with Rebate","SG Transition Pak with Rebate","Bermuda Solutions pak","Utility Pak with Rebate","Select Rebates",null,null,null,null,null,"Banol","2x1gal",256,2,1020,120,{"$error":"#VALUE!"},87.12,2.9384756657483928,{"$error":"#VALUE!"},{"$f":"(ED126-(ED126*$ED$140))","v":{"$error":"#VALUE!"}},{"$f":"EJ126/EH126","v":{"$error":"#VALUE!"}},{"$f":"ED126/EH126","v":347.11875000000003}]
[null,null,null,null,null,null,null,null,null,null,null,null,null,null,null,null,null,null,null,null,null,null,null,null,null,null,null,null,null,null,null,null,null,null,"(B)",null,{"$f":"IF(SUM(AI115:AN126,AI93:AN113)>0,SUM(AI115:AN126,AI93:AN113),\"\")","v":""},null,null,null,null,null,null,null,null,null,null,"(D)",{"$f":"IF(SUM(AV93:AY105,AV112,AV115:AY119)>0,SUM(AV93:AY105,AV112,AV115:AY119),\"\")","v":""},null,null,null,null,null,null,null,null,null,null,null,null,null,null,null,null,null,null,null,null,null,null,null,null,null,null,null,null,null,0.33,"",null,null,null,null,null,null,null,null,null,"PAK$",{"$f":"IF(TRIM(CM89)<>\"\",CM89,\"\")","v":0},null,null,null,null,null,null,null,null,null,null,null,null,null,null,null,null,null,null,null,null,null,null,null,null,null,null,null,null,null,null,null,null,null,null,null,null,null,null,"Specticle G","50 lb/bag",800,{"$f":"$U$112","v":4.5913680000000001},{"$f":"CY140","v":91},5,{"$error":"#VALUE!"},199.99999008,4.0000001984000102,{"$f":"(EF127/EH127)","v":{"$error":"#VALUE!"}},{"$f":"(ED127-(ED127*$ED$140))","v":{"$error":"#VALUE!"}},{"$f":"EJ127/EH127","v":{"$error":"#VALUE!"}},{"$f":"ED127/EH127","v":22.749998871599999}]
[null,null,null,null,null,null,null,null,null,null,null,null,null,null,null,null,null,null,null,null,null,null,null,null,null,null,null,null,null,null,null,null,null,null,null,null,null,null,null,null,null,null,null,null,null,null,null,null,null,null,null,null,null,null,null,null,null,null,null,null,null,null,null,null,null,null,null,null,null,null,null,null,null,null,null,null,null,{"$f":"IF(TRIM(CB132)>0,IF((CB132)=1,TRUE,\"\"),\"\")","v":""},0.5,"",null,null,null,null,null,null,null,null,null,null,null,null,null,null,null,null,null,null,null,null,16,"Bayleton® FLO ",{"$f":"CJ93","v":2700},{"$f":"$U$94","v":0.5},{"$f":"640/($CY$151*CZ128)","v":29.38475665748393},null,{"$f":"($CY$128/$DA$128)*0.91","v":83.614781250000007},{"$f":"($CY$128/$DA$128)*0.92","v":84.533625000000015},{"$f":"($CY$128/$DA$128)*0.93","v":85.452468750000008},{"$f":"($CY$128/$DA$128)*0.94","v":86.371312500000002},{"$f":"($CY$128/$DA$128)*0.95","v":87.290156249999995},{"$f":"($CY$128/$DA$128)*0.96","v":88.209000000000003},{"$f":"$CY$128/$DA$128*0.97","v":89.127843749999997},{"$f":"$CY$128/$DA$128*0.98","v":90.046687500000004},{"$f":"CY128/DA128","v":91.884375000000006},null,79.528756537385576,80.872542780295447,"NA",81.494571942044388,"NA","NA","NA",{"$f":"EI128","v":{"$error":"#VALUE!"}},{"$f":"EL128","v":91.884375000000006},null,null,null,null,"Bayleton FLO","2 x 2.5gal",640,{"$f":"$U$94","v":0.5},{"$f":"CY128","v":2700},450,{"$error":"#VALUE!"},21.78,29.38475665748393,{"$error":"#VALUE!"},{"$f":"(ED128-(ED128*$ED$140))","v":{"$error":"#VALUE!"}},{"$f":"EJ128/EH128","v":{"$error":"#VALUE!"}},{"$f":"ED128/EH128","v":91.884375000000006}]
[null,null,null,null,null,null,null,null,null,null,null,null,null,null,null,null,null,null,null,null,null,null,null,null,null,null,null,null,null,null,null,null,null,null,null,null,null,null,null,null,null,null,null,null,null,null,null,null,null,null,null,null,null,null,null,null,null,null,null,null,null,null,null,null,null,null,null,null,null,null,null,null,null,null,null,null,null,null,0.67,"",null,null,null,null,null,null,null,null,null,null,{"$f":"SUM(CM92:CM128)","v":0},{"$f":"SUM(CN78:CN128)","v":0},null,null,null,null,null,null,null,null,null,"Merit 75® WSP",{"$f":"CJ98","v":1250},{"$f":"$U$99","v":0.19700000000000001},{"$f":"176/($CY$151*CZ129)","v":20.509665179715938},null,{"$f":"($CY$129/$DA$129)*0.91","v":55.461656250000004},{"$f":"($CY$129/$DA$129)*0.92","v":56.071125000000009},{"$f":"($CY$129/$DA$129)*0.93","v":56.680593750000007},{"$f":"($CY$129/$DA$129)*0.94","v":57.290062500000005},{"$f":"($CY$129/$DA$129)*0.95","v":57.899531250000003},{"$f":"($CY$129/$DA$129)*0.96","v":58.509},{"$f":"($CY$129/$DA$129)*0.97","v":59.118468750000005},{"$f":"($CY$129/$DA$129)*0.98","v":59.727937500000003},60.946875000000006,null,35.426426255116489,237.22612548886661,"NA","NA","NA","NA","NA",{"$f":"EI130","v":{"$error":"#VALUE!"}},{"$f":"EL130","v":60.946875000000006},null,null,null,null,"Interface","2x2.5gal",640,{"$f":"$U$98","v":4},772.5,75,{"$error":"#VALUE!"},174.24,3.6730945821854912,{"$error":"#VALUE!"},{"$error":"#VALUE!"},{"$error":"#VALUE!"},210.31312500000001]
[null,null,null,null,null,null,null,null,null,null,null,null,null,null,null,null,null,null,null,null,null,null,null,null,null,null,null,null,null,null,null,null,null,null,null,null,null,null,null,null,null,null,null,null,null,null,null,null,null,null,null,null,null,null,null,null,null,null,null,null,null,null,null,null,null,null,null,null,null,null,null,null,null,null,null,null,null,null,0.83,"",{"$f":"N98*5","v":0},{"$f":"(AP79*45)+(AP81*30)+(AP85*5)+(AP89*15)+(AP82*10)+(AP88*10)","v":0},{"$f":"SUM(CC130:CD130)","v":0},null,null,null,null,null,null,null,null,null,null,null,null,null,null,null,null,null,null,"Tartan® ",{"$f":"CJ102","v":1980},{"$f":"$U$103","v":2},{"$f":"640/($CY$151*CZ130)","v":7.3461891643709825},null,{"$f":"($CY$130/$DA$130)*0.91","v":245.27002499999998},{"$f":"($CY$130/$DA$130)*0.92","v":247.96529999999998},{"$f":"($CY$130/$DA$130)*0.93","v":250.66057499999999},{"$f":"($CY$130/$DA$130)*0.94","v":253.35584999999998},{"$f":"($CY$130/$DA$130)*0.95","v":256.05112499999996},{"$f":"($CY$130/$DA$130)*0.96","v":258.74639999999999},{"$f":"($CY$130/$DA$130)*0.97","v":261.44167499999998},{"$f":"($CY$130/$DA$130)*0.98","v":264.13694999999996},269.52749999999997,null,233.28435250966439,217.81671522159576,"NA","NA",243.98463759745886,"NA","NA",{"$f":"EI132","v":{"$error":"#VALUE!"}},{"$f":"EL132","v":269.52749999999997},null,null,null,null,"Merit 75 WSP","110x1.6oz",176,{"$f":"$U$99","v":0.19700000000000001},1250,200,{"$error":"#VALUE!"},8.5813200000000016,20.509665179715938,{"$error":"#VALUE!"},{"$error":"#VALUE!"},{"$error":"#VALUE!"},60.946875000000006]
[null,null,null,null,null,null,null,null,null,null,null,null,null,null,null,null,null,null,null,null,null,null,null,null,null,null,null,null,null,null,null,null,null,null,null,null,null,null,null,null,null,null,null,null,null,null,null,null,null,null,null,null,null,null,null,null,null,null,null,null,null,null,null,null,null,null,null,null,null,null,null,null,null,null,null,null,null,null,0,"",{"$f":"N99","v":0},{"$f":"(AP79*1)+(AP80*1)","v":0},{"$f":"SUM(CC131:CD131)","v":0},null,null,null,null,null,null,null,null,null,null,null,null,null,null,null,null,null,null,"Banol® 2 x 2.5 ",{"$f":"CJ92","v":1875},{"$f":"$U$93","v":2},{"$f":"640/($CY$151*CZ131)","v":7.3461891643709825},null,{"$f":"($CY$131/$DA$131)*0.91","v":232.26328125000001},{"$f":"($CY$131/$DA$131)*0.92","v":234.81562500000001},{"$f":"($CY$131/$DA$131)*0.93","v":237.36796875000002},{"$f":"($CY$131/$DA$131)*0.94","v":239.92031249999999},{"$f":"($CY$131/$DA$131)*0.95","v":242.47265625},{"$f":"($CY$131/$DA$131)*0.96","v":245.02499999999998},{"$f":"($CY$131/$DA$131)*0.97","v":247.57734374999998},{"$f":"($CY$131/$DA$131)*0.98","v":250.12968749999999},255.234375,null,"NA","NA","NA","NA","NA","NA","NA",{"$f":"EI125","v":{"$error":"#VALUE!"}},{"$f":"EL125","v":251.83125000000001},null,null,null,null,"Nortica","35 lb/bag",560,{"$f":"$U$101","v":1.1499999999999999},477,35,{"$error":"#VALUE!"},50.094000000000001,11.178983510999322,{"$error":"#VALUE!"},{"$error":"#VALUE!"},{"$error":"#VALUE!"},42.669353571428573]
[null,null,{"$f":"BI37","v":""},null,null,null,null,null,null,null,null,null,null,null,null,null,null,null,null,null,null,null,null,null,null,null,null,null,null,null,null,null,null,null,null,null,null,null,null,null,null,null,null,null,null,null,null,null,null,null,null,null,null,null,null,null,null,null,null,null,null,null,null,null,null,null,null,null,null,null,null,null,null,null,null,null,null,null,null,{"$f":"SUM(CB126:CB131)","v":0},{"$f":"N100*5","v":0},{"$f":"(AP81*10)+(AP84*5)+(AP85*5)","v":0},{"$f":"SUM(CC132:CD132)","v":0},null,null,null,null,null,null,null,null,null,null,null,null,null,null,null,null,null,null,null,null,null,null,null,null,null,null,null,null,null,null,null,null,null,null,null,null,null,null,null,null,null,null,null,null,null,null,"Tartan","2x2.5gal",640,{"$f":"$U$103","v":2},{"$f":"CY130","v":1980},350,{"$error":"#VALUE!"},87.12,7.3461891643709825,{"$error":"#VALUE!"},{"$error":"#VALUE!"},{"$error":"#VALUE!"},269.52749999999997]
[null,null,null,null,null,null,null,null,null,null,null,null,null,null,null,null,null,null,null,null,null,null,null,null,null,null,null,null,null,null,null,null,null,null,null,null,null,null,null,null,null,null,null,null,null,null,null,null,null,null,null,null,null,null,null,null,null,null,null,null,null,null,null,null,null,null,null,null,null,null,null,null,null,null,null,null,null,null,0.17,{"$f":"IF(TRIM(#REF!)<>\"\",IF(#REF!-(INT(#REF!))=CA133,1,\"\"),\"\")","v":{"$error":"#REF!"}},null,null,null,null,null,null,null,null,null,null,null,null,null,null,null,null,null,null,null,null,null,null,null,null,null,null,null,null,null,null,null,null,null,null,null,null,null,null,null,null,null,null,null,null,null,null,null,null,null,"26GT","2x2.5gal",640,{"$f":"$U$115","v":4},625,100,{"$error":"#VALUE!"},174.24,3.6730945821854912,{"$error":"#VALUE!"},{"$error":"#VALUE!"},{"$error":"#VALUE!"},170.15625]
[null,"CALCULATE YOUR REBATE",null,null,null,null,null,null,null,null,null,null,null,null,null,null,null,null,null,null,null,null,null,null,null,null,null,null,null,null,null,null,null,null,null,null,null,null,null,null,null,null,null,null,null,null,null,null,null,null,null,null,null,null,null,null,null,null,null,null,null,null,null,null,null,null,null,null,null,null,null,null,null,null,null,null,null,null,0.33,{"$f":"IF(TRIM(#REF!)<>\"\",IF(#REF!-(INT(#REF!))=CA134,1,\"\"),\"\")","v":{"$error":"#REF!"}},null,null,null,null,null,null,null,null,null,null,null,null,null,null,null,null,null,null,null,null,null,"Interface®",{"$f":"CJ97","v":772.5},{"$f":"$U$98","v":4},{"$f":"640/($CY$151*CZ134)","v":3.6730945821854912},null,{"$f":"($CY$134/$DA$134)*0.91","v":191.38494375000002},{"$f":"($CY$134/$DA$134)*0.92","v":193.48807500000001},{"$f":"($CY$134/$DA$134)*0.93","v":195.59120625000003},{"$f":"($CY$134/$DA$134)*0.94","v":197.69433749999999},{"$f":"($CY$134/$DA$134)*0.95","v":199.79746875000001},{"$f":"($CY$134/$DA$134)*0.96","v":201.9006},{"$f":"($CY$134/$DA$134)*0.97","v":204.00373125000002},{"$f":"($CY$134/$DA$134)*0.98","v":206.10686250000001},210.31312500000001,null,122.87192885026072,139.07489436841846,"NA",105.10843910797118,128.50781764366161,171.82444852941177,0,{"$f":"EI129","v":{"$error":"#VALUE!"}},{"$f":"EL129","v":210.31312500000001},null,null,null,null,"Acclaim® Extra"," 4 X 1 gal",512,{"$f":"$U$119","v":0.5},1860,90,{"$error":"#VALUE!"},21.78,23.507805325987142,{"$error":"#VALUE!"},{"$error":"#VALUE!"},{"$error":"#VALUE!"},79.122656250000006]
[null,null,null,null,null,null,null,null,null,null,null,null,null,null,null,null,null,null,null,null,null,null,null,null,null,null,null,null,null,null,null,null,null,null,null,null,null,null,null,null,null,null,null,null,null,null,null,null,null,null,null,null,null,null,null,null,null,null,null,null,null,null,null,null,null,null,null,null,null,null,null,null,null,null,null,null,null,{"$f":"IF(TRIM(CB139)>0,IF((CB139)=1,TRUE,\"\"),\"\")","v":{"$error":"#REF!"}},0.5,{"$f":"IF(TRIM(#REF!)<>\"\",IF(#REF!-(INT(#REF!))=CA135,1,\"\"),\"\")","v":{"$error":"#REF!"}},{"$f":"N103*5","v":0},{"$f":"(AP79*30)+(AP80*15)+(AP82*5)+(AP86*5)+(AP85*5)","v":0},{"$f":"SUM(CC135:CD135)","v":0},null,null,null,null,null,null,null,null,null,null,null,null,null,null,null,null,null,null,"Signature ",{"$f":"CJ106","v":1133.25},{"$f":"$U$106","v":4},{"$f":"704/($CY$151*CZ135)","v":4.0404040404040398},null,{"$f":"($CY$135/$DA$135)*0.91","v":255.23623125000006},{"$f":"($CY$135/$DA$135)*0.92","v":258.04102500000005},{"$f":"($CY$135/$DA$135)*0.93","v":260.84581875000009},{"$f":"($CY$135/$DA$135)*0.94","v":263.65061250000002},{"$f":"($CY$135/$DA$135)*0.95","v":266.45540625000007},{"$f":"($CY$135/$DA$135)*0.96","v":269.26020000000005},{"$f":"($CY$135/$DA$135)*0.97","v":272.06499375000004},{"$f":"($CY$135/$DA$135)*0.98","v":274.86978750000003},280.47937500000006,null,"NA","NA","NA","NA","NA","NA","NA","NA",null,null,null,null,null,"Compass","4x1lb",64,{"$f":"$U$117","v":0.25},1580,200,{"$error":"#VALUE!"},10.89,5.8769513314967856,{"$error":"#VALUE!"},{"$f":"(ED135-(ED135*$ED$140))","v":{"$error":"#VALUE!"}},{"$f":"EJ135/EH135","v":{"$error":"#VALUE!"}},{"$f":"ED135/EH135","v":268.84687500000001}]
[null,"PURCHASE\nTOTAL",null,null,null,null,null,"BASE\nBONUS",null,null,null,"OCTOBER\nBONUS+++",null,"BAYER PAK\nBONUS+",null,null,null,"..(C) TOTAL PROGRAM\nREBATE++",null,null,null,null,null,null,null,null,null,null,null,null,null,null,null,null,null,null,null,null,null,null,null,null,null,null,null,null,null,null,null,null,null,null,null,null,null,null,null,null,null,null,null,null,null,null,null,null,null,null,null,null,null,null,null,null,null,null,null,null,0.67,{"$f":"IF(TRIM(#REF!)<>\"\",IF(#REF!-(INT(#REF!))=CA136,1,\"\"),\"\")","v":{"$error":"#REF!"}},null,null,null,null,null,null,null,null,null,null,null,null,null,null,null,null,null,null,null,null,null,"Nortica",{"$f":"CJ100","v":491.31},{"$f":"$U$101","v":1.1499999999999999},{"$f":"560/($CY$151*CZ136)","v":11.178983510999322},null,{"$f":"($CY$136/$DA$136)*0.91","v":39.993985102500005},{"$f":"($CY$136/$DA$136)*0.92","v":40.433479444285716},{"$f":"($CY$136/$DA$136)*0.93","v":40.872973786071434},{"$f":"($CY$136/$DA$136)*0.94","v":41.312468127857144},{"$f":"($CY$136/$DA$136)*0.95","v":41.751962469642855},{"$f":"($CY$136/$DA$136)*0.96","v":42.191456811428573},{"$f":"($CY$136/$DA$136)*0.97","v":42.630951153214284},{"$f":"($CY$136/$DA$136)*0.98","v":43.070445495000001},43.94943417857143,null,"NA","NA","NA","NA","NA","NA","NA",{"$f":"EI131","v":{"$error":"#VALUE!"}},{"$f":"EL131","v":42.669353571428573},null,null,null,null,"Compass","20X8oz",160,{"$f":"$U$116","v":0.25},3900,500,{"$error":"#VALUE!"},10.89,14.692378328741965,{"$error":"#VALUE!"},{"$error":"#VALUE!"},{"$error":"#VALUE!"},265.44375000000002]
[null,null,null,null,null,null,null,null,null,null,null,null,null,null,null,null,null,null,null,null,null,null,null,null,null,null,null,null,null,null,null,null,null,null,null,null,null,null,null,null,null,null,null,null,null,null,null,null,null,null,null,null,null,null,null,null,null,null,null,null,null,null,null,null,null,null,null,null,null,null,null,null,null,null,null,null,null,null,0.83,{"$f":"IF(TRIM(#REF!)<>\"\",IF(#REF!-(INT(#REF!))=CA137,1,\"\"),\"\")","v":{"$error":"#REF!"}},null,null,null,null,null,null,null,null,null,null,null,null,null,null,null,null,null,null,null,null,null,"Fiata Stressgard",{"$f":"CJ96","v":250},{"$f":"$U$97","v":5},{"$f":"640/($CY$151*CZ137)","v":2.9384756657483928},null,{"$f":"($CY$137/$DA$137)*0.91","v":77.421093749999997},{"$f":"($CY$137/$DA$137)*0.92","v":78.271875000000009},{"$f":"($CY$137/$DA$137)*0.93","v":79.122656250000006},{"$f":"($CY$137/$DA$137)*0.94","v":79.973437499999989},{"$f":"($CY$137/$DA$137)*0.95","v":80.82421875},{"$f":"($CY$137/$DA$137)*0.96","v":81.674999999999997},{"$f":"($CY$137/$DA$137)*0.97","v":82.525781249999994},{"$f":"($CY$137/$DA$137)*0.98","v":83.376562499999991},85.078125,null,"NA","NA","NA","NA","NA","NA","NA",{"$f":"EI138","v":{"$error":"#VALUE!"}},{"$f":"EL138","v":85.078125},null,null,null,null,"Prostar","4x3 lb",192,{"$f":"$U$118","v":2.2000000000000002},720,36,{"$error":"#VALUE!"},95.832000000000008,2.0035061357375405,{"$error":"#VALUE!"},{"$error":"#VALUE!"},{"$error":"#VALUE!"},359.37]
[null,"$2,500 < $10,000",null,null,null,null,null,0.02,null,null,null,0.01,null,0.01,null,null,null,0.04,null,null,null,null,null,null,null,null,null,null,null,null,null,null,null,null,null,null,null,null,null,null,null,null,null,null,null,null,null,null,null,null,null,null,null,null,null,null,null,null,null,null,null,null,null,null,null,null,null,null,null,null,null,null,null,null,null,null,null,null,0,{"$f":"IF(TRIM(#REF!)<>\"\",IF(#REF!-(INT(#REF!))=CA138,1,\"\"),\"\")","v":{"$error":"#REF!"}},null,null,null,null,null,null,null,null,null,null,null,null,null,null,null,null,null,null,null,null,null,"Mirage Stressgard",{"$f":"CJ99","v":875},{"$f":"$U$100","v":1},{"$f":"640/($CY$151*CZ138)","v":14.692378328741965},null,{"$f":"($CY$138/$DA$138)*0.91","v":54.194765625000002},{"$f":"($CY$138/$DA$138)*0.92","v":54.790312499999999},{"$f":"($CY$138/$DA$138)*0.93","v":55.385859375000003},{"$f":"($CY$138/$DA$138)*0.94","v":55.981406249999999},{"$f":"($CY$138/$DA$138)*0.95","v":56.576953124999996},{"$f":"($CY$138/$DA$138)*0.96","v":57.172499999999999},{"$f":"($CY$138/$DA$138)*0.97","v":57.768046874999996},{"$f":"($CY$138/$DA$138)*0.98","v":58.36359375},59.5546875,null,"NA","NA","NA",125.90911365045858,"NA","NA","NA",{"$f":"EI139","v":{"$error":"#VALUE!"}},{"$f":"EL139","v":59.5546875},null,null,null,null,"Fiata Stressgard","2x2.5gal",640,{"$f":"$U$97","v":5},250,50,{"$error":"#VALUE!"},217.8,2.9384756657483928,{"$error":"#VALUE!"},{"$error":"#VALUE!"},{"$error":"#VALUE!"},85.078125]
[null,"$10,000 < $15,000",null,null,null,null,null,0.03,null,null,null,0.01,null,0.01,null,null,null,0.05,null,null,null,null,null,null,null,null,null,null,null,null,null,null,null,null,null,null,null,null,null,null,null,null,null,null,null,null,null,null,null,null,null,null,null,null,null,null,null,null,null,null,null,null,null,null,null,null,null,null,null,null,null,null,null,null,null,null,null,null,null,{"$f":"SUM(CB133:CB138)","v":{"$error":"#REF!"}},null,null,null,null,null,null,null,null,null,null,null,null,null,null,null,null,null,null,null,null,null,"Specticle® FLO",{"$f":"CJ110","v":1816},{"$f":"$U$111","v":0.1492},{"$f":"144/($CY$151*CZ139)","v":22.156736755810602},null,{"$f":"($CY$139/$DA$139)*0.91","v":74.584990480000002},{"$f":"($CY$139/$DA$139)*0.92","v":75.40460576000001},{"$f":"($CY$139/$DA$139)*0.93","v":76.224221040000003},{"$f":"($CY$139/$DA$139)*0.94","v":77.043836319999997},{"$f":"($CY$139/$DA$139)*0.95","v":77.863451599999991},{"$f":"($CY$139/$DA$139)*0.96","v":78.683066879999998},{"$f":"($CY$139/$DA$139)*0.97","v":79.502682159999992},{"$f":"($CY$139/$DA$139)*0.98","v":80.32229744},81.961528000000001,null,"NA","NA","NA","NA","NA","NA","NA","NA",null,null,null,null,null,"Mirage Stressgard","2x2.5gal",640,{"$f":"$U$100","v":1},875,75,{"$error":"#VALUE!"},43.56,14.692378328741965,{"$error":"#VALUE!"},{"$error":"#VALUE!"},{"$error":"#VALUE!"},59.5546875]
[null,"$15,000 < $25,000",null,null,null,null,null,0.04,null,null,null,0.01,null,0.01,null,null,null,0.06,null,null,null,null,null,null,null,null,null,null,null,null,null,"October Bonus",null,null,null,null,null,null,null,null,null,null,null,null,null,null,null,null,null,null,null,null,null,null,null,null,null,null,null,null,null,null,null,null,null,null,null,null,null,null,null,null,null,null,null,null,null,null,0.17,{"$f":"IF(TRIM($N$122)<>\"\",IF($N$122-(INT($N$122))=CA140,1,\"\"),\"\")","v":""},null,null,null,null,null,null,null,null,null,null,null,null,null,null,null,null,null,null,null,null,null,"Specticle G",{"$f":"CJ111","v":91},{"$f":"$U$112","v":4.5913680000000001},{"$f":"800/($CY$151*CZ140)","v":4.0000001984000102},null,{"$f":"($CY$140/$DA$140)*0.91","v":20.702498973156001},{"$f":"($CY$140/$DA$140)*0.92","v":20.929998961871998},{"$f":"($CY$140/$DA$140)*0.93","v":21.157498950588},{"$f":"($CY$140/$DA$140)*0.94","v":21.384998939303998},{"$f":"($CY$140/$DA$140)*0.95","v":21.612498928019999},{"$f":"($CY$140/$DA$140)*0.96","v":21.839998916735997},{"$f":"($CY$140/$DA$140)*0.97","v":22.067498905451998},{"$f":"($CY$140/$DA$140)*0.98","v":22.294998894168},22.749998871599999,null,"NA","NA","NA","NA","NA","NA","NA",{"$f":"EI127","v":{"$error":"#VALUE!"}},{"$f":"EL127","v":22.749998871599999},null,null,null,null,null,null,null,null,{"$f":"P147","v":""},null,null,null,null,null,43.56]
[null,"$25,000 < $28,500",null,null,null,null,null,0.05,null,null,null,0.01,null,0.01,null,null,null,7.0000000000000007E-2,null,null,null,null,null,null,null,null,null,null,null,null,null,null,null,null,null,null,null,null,null,null,null,null,null,null,null,null,null,null,null,null,null,null,null,null,null,null,null,null,null,null,null,null,null,null,null,null,null,null,null,null,null,null,null,null,null,null,null,null,0.33,""]
[null,"$28,500 < $40,000",null,null,null,null,null,"Total program rebate for all purchases Oct 1 - Dec 9, 2016",null,null,null,null,null,null,null,null,null,0.08,null,null,null,null,null,null,null,null,null,null,null,null,null,null,null,null,null,null,null,null,null,null,null,null,null,null,null,null,null,null,null,null,null,null,null,null,null,null,null,null,null,null,null,null,null,null,null,null,null,null,null,null,null,null,null,null,null,null,null,{"$f":"IF(TRIM(CB146)>0,IF((CB146)=1,TRUE,\"\"),\"\")","v":""},0.5,"",null,null,null,null,null,null,null,null,null,null,null,null,null,null,null,null,null,null,null,null,null,"Non Agency Case goods","In season","Rate",null,null,0.09,0.08,7.0000000000000007E-2,6.0000000000000005E-2,0.05,0.04,0.03,0.02,null,null,"SP With Rebate","Ess Pak With Rebate","Greens Pak with Rebate","Fairway Pak with Rebate","SG Transition Pak with Rebate","Bermuda Solutions pak","Utility Pak with Rebate","Select Rebates"]
[null,"$40K+",null,null,null,null,null,null,null,null,null,null,null,null,null,null,null,0.09,null,null,null,null,null,null,null,null,null,null,null,null,null,null,null,null,null,null,null,null,null,null,null,null,null,null,null,null,null,null,null,null,null,null,null,null,null,null,null,null,null,null,null,null,null,null,null,null,null,null,null,null,null,null,null,null,null,null,null,null,0.67,"",null,null,null,null,null,null,null,null,null,null,null,null,null,null,null,null,null,null,null,null,null,"Signature ",{"$f":"CJ106","v":1133.25},{"$f":"$U$120","v":4},{"$f":"352/($CY$151*CZ143)","v":2.0202020202020199},null,{"$f":"($CY$143/$DA$143)*0.91","v":510.47246250000012},{"$f":"($CY$143/$DA$143)*0.92","v":516.08205000000009},{"$f":"($CY$143/$DA$143)*0.93","v":521.69163750000018},{"$f":"($CY$143/$DA$143)*0.94","v":527.30122500000004},{"$f":"($CY$143/$DA$143)*0.95","v":532.91081250000013},{"$f":"($CY$143/$DA$143)*0.96","v":538.52040000000011},{"$f":"($CY$143/$DA$143)*0.97","v":544.12998750000008},{"$f":"($CY$143/$DA$143)*0.98","v":549.73957500000006},{"$f":"CY143/DA143","v":560.95875000000012},null,214.19745094069182,217.81671522159576,200.53483947681335,"NA",224.02225815766678,224.65073529411765,"NA","NA"]
[null,null,null,null,null,null,null,null,null,null,null,null,null,null,null,null,null,null,null,null,null,null,null,null,null,null,null,null,null,null,null,null,null,null,null,null,null,null,null,null,null,null,null,null,null,null,null,null,null,null,null,null,null,null,null,null,null,null,null,null,null,null,null,null,null,null,null,null,null,null,null,null,null,null,null,null,null,null,0.83,"",null,null,null,null,null,null,null,null,null,null,null,null,null,null,null,null,null,null,null,null,null,"26GT",{"$f":"ED133","v":625},{"$f":"$U$115","v":4},{"$f":"640/($CY$151*CZ144)","v":3.6730945821854912},null,{"$f":"($CY$144/$DA$144)*0.91","v":154.84218749999999},{"$f":"($CY$144/$DA$144)*0.92","v":156.54375000000002},{"$f":"($CY$144/$DA$144)*0.93","v":158.24531250000001},{"$f":"($CY$144/$DA$144)*0.94","v":159.94687499999998},{"$f":"($CY$144/$DA$144)*0.95","v":161.6484375},{"$f":"($CY$144/$DA$144)*0.96","v":163.35},{"$f":"($CY$144/$DA$144)*0.97","v":165.05156249999999},{"$f":"($CY$144/$DA$144)*0.98","v":166.75312499999998},170.15625,null,"NA","NA",124.0933412604043,105.10843910797118,"NA","NA","NA",{"$f":"EI133","v":{"$error":"#VALUE!"}},{"$f":"EL133","v":170.15625}]
[null,null,null,null,null,null,null,null,null,null,null,null,null,null,null,null,null,null,null,null,null,null,null,null,null,null,null,null,null,null,null,null,null,null,null,null,null,"SELECT REBATE (D)\n(IF APPLICABLE)",null,null,null,null,null,null,null,null,null,null,null,null,null,null,null,null,null,null,null,null,null,null,null,null,null,null,null,null,null,null,null,null,null,null,null,null,null,null,null,null,0,"",null,null,null,null,null,null,null,null,null,null,null,null,null,null,null,null,null,null,null,null,null,"Compass (20x8oz)",{"$f":"ED136","v":3900},{"$f":"$U$116","v":0.25},{"$f":"160/($CY$151*CZ145)","v":14.692378328741965},null,{"$f":"($CY$145/$DA$145)*0.91","v":241.55381250000002},{"$f":"($CY$145/$DA$145)*0.92","v":244.20825000000002},{"$f":"($CY$145/$DA$145)*0.93","v":246.86268750000002},{"$f":"($CY$145/$DA$145)*0.94","v":249.51712500000002},{"$f":"($CY$145/$DA$145)*0.95","v":252.17156250000002},{"$f":"($CY$145/$DA$145)*0.96","v":254.82600000000002},{"$f":"($CY$145/$DA$145)*0.97","v":257.48043749999999},{"$f":"($CY$145/$DA$145)*0.98","v":260.13487500000002},265.44375000000002,null,"NA","NA","NA","NA","NA","NA","NA",{"$f":"EI136","v":{"$error":"#VALUE!"}},{"$f":"EL136","v":265.44375000000002}]
[null,null,null,null,null,null,null,"TOTAL $ (A + B)",null,null,null,null,null,null,"TOTAL PROGRAM REBATE_(C)",null,null,null,null,null,null,null,null,null,null,"TOTAL PROGRAM REBATE",null,null,null,null,null,null,null,null,null,null,null,null,null,null,null,null,null,null,null,"GRAND TOTAL REBATE $",null,null,null,null,null,null,null,null,null,null,null,null,null,null,null,null,null,null,null,null,null,null,null,null,null,null,null,null,null,null,null,null,null,{"$f":"SUM(CB140:CB145)","v":0},{"$f":"N115*5","v":0},{"$f":"(AP80*30)+(AP81*30)+(AP83*25)","v":0},{"$f":"SUM(CC146:CD146)","v":0},null,null,null,null,null,null,null,null,null,null,null,null,null,null,null,null,null,null,"Compass (4x1lb)",{"$f":"ED135","v":1580},{"$f":"$U$117","v":0.25},{"$f":"64/($CY$151*CZ146)","v":5.8769513314967856},null,{"$f":"($CY$146/$DA$146)*0.91","v":244.65065625000003},{"$f":"($CY$146/$DA$146)*0.92","v":247.33912500000002},{"$f":"($CY$146/$DA$146)*0.93","v":250.02759375000002},{"$f":"($CY$146/$DA$146)*0.94","v":252.71606249999999},{"$f":"($CY$146/$DA$146)*0.95","v":255.40453124999999},{"$f":"($CY$146/$DA$146)*0.96","v":258.09300000000002},{"$f":"($CY$146/$DA$146)*0.97","v":260.78146874999999},{"$f":"($CY$146/$DA$146)*0.98","v":263.46993750000001},268.84687500000001,null,"NA","NA","NA","NA","NA","NA","NA",{"$f":"EI135","v":{"$error":"#VALUE!"}},{"$f":"EL135","v":268.84687500000001}]
[null,null,null,null,null,null,null,{"$f":"IF(CO3=2,\"\",BL17)","v":""},null,null,null,null,null,"x",null,{"$f":"IF(BL18<>\"\",BL18,\"\")","v":""},null,null,null,null,null,null,null,"=",null,{"$f":"IF(CO3=2,\"\",IF(BL19>0,BL19,\"\"))","v":""},null,null,null,null,null,null,null,null,"+",null,null,{"$f":"IF(CO3=2,\"\",BL20)","v":""},null,null,null,null,null,null,"=",{"$f":"IF(TRIM(BL25)=\"\",\"\",IF(BL25>0,BL25,\"\"))","v":""},null,null,null,null,null,null,null,null,null,null,null,null,null,null,null,null,null,null,null,null,null,null,null,null,null,null,null,null,null,null,null,null,null,null,null,null,null,null,null,null,null,null,null,null,null,null,null,null,null,null,null,null,null,null,null,"Prostar ",{"$f":"ED137","v":720},{"$f":"$U$118","v":2.2000000000000002},{"$f":"192/($CY$151*CZ147)","v":2.0035061357375405},null,{"$f":"($CY$147/$DA$147)*0.91","v":327.02670000000001},{"$f":"($CY$147/$DA$147)*0.92","v":330.62040000000002},{"$f":"($CY$147/$DA$147)*0.93","v":334.21410000000003},{"$f":"($CY$147/$DA$147)*0.94","v":337.80779999999999},{"$f":"($CY$147/$DA$147)*0.95","v":341.4015},{"$f":"($CY$147/$DA$147)*0.96","v":344.99520000000001},{"$f":"($CY$147/$DA$147)*0.97","v":348.58889999999997},{"$f":"($CY$147/$DA$147)*0.98","v":352.18259999999998},359.37,null,"NA","NA","NA","NA","NA",293.60294117647061,"NA",{"$f":"EI137","v":{"$error":"#VALUE!"}},{"$f":"EL137","v":359.37}]
[null,null,null,null,null,null,null,null,null,null,null,null,null,null,null,null,null,null,null,null,null,null,null,null,null,null,null,null,null,null,null,null,null,null,null,null,null,null,null,null,null,null,null,null,null,"X 100 =  \nMyBayerRewards POINTS",null,null,null,null,null,null,null,null,null,null,null,null,null,null,null,null,null,null,null,null,null,null,null,null,null,null,null,null,null,null,null,null,null,null,{"$f":"N116*10","v":0},{"$f":"N117*4","v":0},{"$f":"SUM(CC148:CD148)","v":0},null,null,null,null,null,null,null,null,null,null,null,null,null,null,null,null,null,null,"Acclaim® Extra",1860,{"$f":"$U$119","v":0.5},{"$f":"512/($CY$151*CZ148)","v":23.507805325987142},null,{"$f":"($CY$148/$DA$148)*0.91","v":72.001617187500003},{"$f":"($CY$148/$DA$148)*0.92","v":72.792843750000003},{"$f":"($CY$148/$DA$148)*0.93","v":73.584070312500003},{"$f":"($CY$148/$DA$148)*0.94","v":74.375296875000004},{"$f":"($CY$148/$DA$148)*0.95","v":75.166523437500004},{"$f":"($CY$148/$DA$148)*0.96","v":75.957750000000004},{"$f":"($CY$148/$DA$148)*0.97","v":76.748976562500005},{"$f":"($CY$148/$DA$148)*0.98","v":77.540203125000005},79.122656250000006,null,"NA","NA","NA","NA","NA","NA","NA",{"$f":"EI134","v":{"$error":"#VALUE!"}},{"$f":"EL134","v":79.122656250000006}]
[null,null,null,null,null,null,null,null,null,null,null,null,null,null,"GRAND TOTAL REBATE EARNED   ",null,null,null,null,null,null,null,null,null,null,null,null,null,null,null,null,null,null,null,null,null,null,null,null,null,null,null,null,null,null,null,null,null,null,null,null,null,null,null,null,null,null,null,null,null,null,null,null,null,null,null,null,null,null,null,null,null,null,null,null,null,null,null,null,null,{"$f":"N117*4","v":0},{"$f":"N116*10","v":0},0,null,null,null,null,null,null,null,null,null,null,null,null,null,null,null,null,null,null,"Banol  2 x 1 gal ",{"$f":"ED126","v":1020},{"$f":"2","v":2},{"$f":"256/($CY$151*CZ149)","v":2.9384756657483928},null,{"$f":"($CY$149/$DA$149)*0.91","v":315.87806250000006},{"$f":"($CY$149/$DA$149)*0.92","v":319.34925000000004},{"$f":"($CY$149/$DA$149)*0.93","v":322.82043750000003},{"$f":"($CY$149/$DA$149)*0.94","v":326.29162500000001},{"$f":"($CY$149/$DA$149)*0.95","v":329.7628125},{"$f":"($CY$149/$DA$149)*0.96","v":333.23400000000004},{"$f":"($CY$149/$DA$149)*0.97","v":336.70518750000002},{"$f":"($CY$149/$DA$149)*0.98","v":340.17637500000001},347.11875000000003,null,196.17093279221777,"NA","NA","NA","NA","NA","NA",{"$f":"EI126","v":{"$error":"#VALUE!"}},{"$f":"EL126","v":347.11875000000003}]
[null,null,null,null,null,null,null,null,null,null,null,null,null,null,null,{"$f":"IF(CM129>=2500,IF(TRIM(AT147)<>\"\",IF(AT147>0,(AT147)/(BL1),\"\"),\"\"),\"\")","v":""},null,null,null,null,null,null,null,null,null,null,null,null,null,null,null,null,null,null,null,null,null,null,null,null,null,null,null,null,null,{"$f":"IF((CO3)<>2,\"\",IF((BL25)=\"\",\"\",(BL25)*100))","v":""},null,null,null,null,null,null,null,null,null,null,null,null,null,null,null,null,null,null,null,null,null,null,null,null,null,null,null,null,null,null,null,null,null,null,{"$f":"N118*12","v":0},{"$f":"(AP82*48)+(AP86*48)","v":0},{"$f":"SUM(CC150:CD150)","v":0},null,null,null,null,null,null,null,null,null,null,null,null,null,null,null,null,null,null,null,null,null,6.4]
[null,null,null,null,null,null,null,null,null,null,null,null,null,null,null,null,null,null,null,null,null,null,null,null,null,null,null,null,null,null,null,null,null,null,null,null,null,null,null,null,null,null,null,null,null,null,null,null,null,null,null,null,null,null,null,null,null,null,null,null,null,null,null,null,null,null,null,null,null,null,null,null,null,null,null,null,null,null,null,null,null,null,null,null,null,null,null,null,null,null,null,null,null,null,null,null,null,null,null,null,null,null,43.56]
[null,"I would like to receive (choose one):     ",null,null,null,null,null,null,null,null,null," MyBayerRewards Points   ",null,null,null,null,null,null,null,"or",null,null,null,"Distributor Credit  ",null,null,null,null,null,null,null,null,null,null,"MyBayerRewards Member ID"]
[]
[null,"           Verify your rebate selection and update your profile at My Bayer Rewards\n by 1st March, 2017  \nmyrewards.cropscience.bayer.com"]
[]
[]
[]
[]
[null,"Customer Fall Solutions and NOW promotional cumulative purchases (August 1 - December 9, 2016) must be $2,500 or more to qualify for Select Product Rebates and Total Program Rebates.  Participants must be members of MyBayerRewards.  New members signed up before March 1, 2017 will receive 2016 Fall Solutions rebates. All rebates for 2016 Bayer Fall Solutions will be paid based on participant's My Bayer Rewards profile choice as of March 1, 2017 . If no selection is made, the default for Fall Solutions rebate will be Loyalty Points. Purchases qualifying for rebates will be the net of reward or credits. All products must be invoiced between October 1 and December 9, 2016 to qualify. Rebate calculations will be based on the date of actual product invoice and calculator tools are provided for estimation purposes only. Rebates will only be paid or delivered to the company or name listed on the invoice. No checks can be issued to a third party. Please allow for rebates to be fulfilled by August 31, 2017. Only end-user purchases qualify for this program, and purchases must be from a Bayer authorized Distributor or Agent. Resale of product(s) purchased within this program will not qualify for Distributor Credits or My Bayer Rewards points. If questions arise, please contact My Bayer Rewards at 1-888-456-6464 or e-mail mybayerrewards@aimia.com. Bayer CropScience LP, Environmental Science Division, 2 T.W. Alexander Drive, Research Triangle Park, NC 27709. 1-800-331-2867. www.BackedbyBayer.com. Bayer (reg'd), the Bayer Cross (reg'd), 26GT®, Acclaim®, Banol®, Bayleton®,Celsius® Chipco®, Compass®, Dylox®, Fiata®, Forbid®, Interface®, Merit®, Mirage®, Nortica®, Prostar®, Proxy®, Ronstar®, Signature™ Specticle®, Signature™ Stressgard®, Tartan®, Tribute® and Topchoice® are trademarks of Bayer. Please verify state registration of these products in your state before selling, using or distributing. Not all products and rates are registered in all states. Always read and follow label instructions. ©2016 Bayer CropScience LP. 14BPG-059-FS1"]
[]
[]
[]
[]
[]
[]
[null,"Contact Name",null,null,null,null,null,null,null,null,null,null,null,null,null,null,null,null,null,null,null,null,null," Golf Course Number"]

{"sheet":"Sheet2","index":1,"n_rows":0,"n_cols":0,"rows_kept":0,"cut":false,"hidden":false,"merged":[]}

{"sheet":"Sheet1","index":2,"n_rows":0,"n_cols":0,"rows_kept":0,"cut":false,"hidden":false,"merged":[]}