{"text_format":"1","workbook":"xlsx","n_sheets":12,"sheets":["EOP Order Form","ProductList","COMAND","Grigg Brothers","GV Water Soluables","Performance Nutritution","Lebanon","Venture Line","Brandt","Earthworks","Turf Protection","Adjuvants"],"not_rendered":{"charts":0,"images":3,"macros":1,"external_links":0,"defined_names":2,"comments":0,"pivot_tables":0},"unopened":[],"bounds":{"document_bytes":16777216,"sheet_cells":100000,"rows_first":2000,"rows_last":500,"rows_between":2000,"halvings":0,"cell_chars":16384,"cell_head_chars":4096},"cells_cut":0,"cells_raw":0,"read":"whole","date_system":"1900"}

{"sheet":"EOP Order Form","index":0,"n_rows":53,"n_cols":54,"rows_kept":53,"cut":false,"hidden":false,"merged":[[46,6,46,7],[47,6,47,7],[1,6,2,8],[3,7,3,8],[4,7,4,8],[5,7,5,8],[6,7,6,8],[7,7,7,8],[8,7,8,8],[9,7,9,8],[10,7,10,8],[11,7,11,8],[12,7,12,8],[5,1,5,2],[6,1,6,2],[7,1,7,2],[8,1,8,2],[45,6,45,7]]}
[]
[null,null,null,null,null,null,"Customer Information"]
[]
[null,null,null,null,null,null,"PO :"]
[null,null,null,null,null,null,"Name :"]
[null,"Golf Ventures",null,null,null,null,"Company Name :"]
[null,"5385 Gateway Blvd STE 12",null,null,null,null," Email :"]
[null,"Lakeland FL 33811",null,null,null,null,"Phone :"]
[null,"863-665-5800 | (866) 853-4653",null,null,null,null," Address 1 :"]
[null,null,null,null,null,null,"Address 2 :"]
[null,"Order No. :",null,null,null,null,"City :"]
[null,null,null,null,null,null,"State :"]
[null,"Order Date :",null,null,null,null,"Zip :"]
[]
[null,"Quantity","Vendor","Item","Description","Package Size","Price / UOM","UOM","Total",null,null,null,null,null,null,null,null,null,null,null,null,null,null,null,null,null,null,null,null,null,null,null,null,null,null,null,null,null,null,null,null,null,null,null,null,null,null,null,null,null,null,null,null,"Product ID"]
[null,null,null,{"$f":"IFERROR(INDEX(INDIRECT(\"'\"&$C16&\"'!\"&\"$B$9:$B$500\"),MATCH(RIGHT($BB16,10),INDIRECT(\"'\"&$C16&\"'!\"&\"$A$9:$A$500\"),0),),\"\")","v":""},{"$f":"IFERROR(INDEX(INDIRECT(\"'\"&$C16&\"'!\"&\"$D$9:$D$500\"),MATCH(RIGHT($BB16,10),INDIRECT(\"'\"&$C16&\"'!\"&\"$A$9:$A$500\"),0),),\"\")","v":""},{"$f":"IFERROR(INDEX(INDIRECT(\"'\"&$C16&\"'!\"&\"$C$9:$C$500\"),MATCH(RIGHT($BB16,10),INDIRECT(\"'\"&$C16&\"'!\"&\"$A$9:$A$500\"),0),),\"\")","v":""},{"$f":"IFERROR(INDEX(INDIRECT(\"'\"&$C16&\"'!\"&\"$E$9:$E$500\"),MATCH(RIGHT($BB16,10),INDIRECT(\"'\"&$C16&\"'!\"&\"$A$9:$A$500\"),0),),\"\")","v":""},{"$f":"IFERROR(INDEX(INDIRECT(\"'\"&$C16&\"'!\"&\"$F$9:$F$500\"),MATCH(RIGHT($BB16,10),INDIRECT(\"'\"&$C16&\"'!\"&\"$A$9:$A$500\"),0),),\"\")","v":""},{"$f":"IF(B16=\"\",\"\",(G16*B16))","v":""}]
[null,null,null,"","","","","",""]
[null,null,null,"","","","","",""]
[null,null,null,"","","","","",""]
[null,null,null,"","","","","",""]
{"$rows_left_out":34}
{"sheet":"ProductList","index":1,"n_rows":401,"n_cols":8,"rows_kept":401,"cut":false,"hidden":true,"merged":[]}
[]
["Adjuvants","AB_WAP-001","80/20 Select™","80% Nonionic Surfactant","2 x 2.5 Gallon","80/20 Select™ | 80% Nonionic Surfactant | 2 x 2.5 Gallon                                                                                                     | AB_WAP-001",19.7,"Gallon"]
["Adjuvants","AB_WAP-002","Defoamer Select™","Defoamer","12x1 Quart","Defoamer Select™ | Defoamer | 12x1 Quart                                                                                                     | AB_WAP-002",160.19999999999999,"Case"]
["Adjuvants","AB_WAP-003","Duo Stick Select™","MSO + Organosilicone Blend","2 x 2.5 Gallon","Duo Stick Select™ | MSO + Organosilicone Blend | 2 x 2.5 Gallon                                                                                                     | AB_WAP-003",88.45,"Jug"]
["Adjuvants","AB_WAP-004","Foam Marker Select™","Foam Marker","12x1 Quart","Foam Marker Select™ | Foam Marker | 12x1 Quart                                                                                                     | AB_WAP-004",197.14,"Case"]
["Adjuvants","AB_WAP-005","Masking Agent Select™","Masking Agent (Winter Green)","12x1 Quart","Masking Agent Select™ | Masking Agent (Winter Green) | 12x1 Quart                                                                                                     | AB_WAP-005",420,"Case"]
["Adjuvants","AB_WAP-006","MSO Select™","Methylated Seed Oil","2 x 2.5 Gallon","MSO Select™ | Methylated Seed Oil | 2 x 2.5 Gallon                                                                                                     | AB_WAP-006",64.25,"Jug"]
["Adjuvants","AB_WAP-007","PS 804 Select™","Similar to LI 700®","2 x 2.5 Gallon","PS 804 Select™ | Similar to LI 700® | 2 x 2.5 Gallon                                                                                                     | AB_WAP-007",75,"Jug"]
["Adjuvants","AB_WAP-008","Tank Cleaner Select™","Tank Cleaner","12x1 Quart","Tank Cleaner Select™ | Tank Cleaner | 12x1 Quart                                                                                                     | AB_WAP-008",157.19999999999999,"Case"]
["Adjuvants","AB_WAP-009","TPC - Turf Tech Turf Pigment Cleaner ","Turf Colorant Cleaner/Remover","12x16 Oz","TPC - Turf Tech Turf Pigment Cleaner  | Turf Colorant Cleaner/Remover | 12x16 Oz                                                                                                     | AB_WAP-009",144,"Case"]
["Adjuvants","AB_WAP-010","Triple Max Select™","H20 Conditioner/Acidifer/Surfactant","4 x 1 Gallon","Triple Max Select™ | H20 Conditioner/Acidifer/Surfactant | 4 x 1 Gallon                                                                                                     | AB_WAP-010",37.85,"Gallon"]
["Adjuvants","AB_WAP-011","Turf Tech MPC","Multi-Purpose Cleaner","12x16 Oz","Turf Tech MPC | Multi-Purpose Cleaner | 12x16 Oz                                                                                                     | AB_WAP-011",59,"Case"]
["Adjuvants","AB_WAP-012","Turf Tech Tank Wash","Tank Cleaner","2 x 2.5 Gallon","Turf Tech Tank Wash | Tank Cleaner | 2 x 2.5 Gallon                                                                                                     | AB_WAP-012",157.19999999999999,"Case"]
["Adjuvants","AB_WAP-013","Venture AMS 80/20 Surfactant","80% Nonionic Surfactant","4 x 1 Gallon","Venture AMS 80/20 Surfactant | 80% Nonionic Surfactant | 4 x 1 Gallon                                                                                                     | AB_WAP-013",17,"Gallon"]
["Adjuvants","AB_WAP-014","Venture Clean Tank Cleaner","Tank Cleaner","12 x 1 Quart","Venture Clean Tank Cleaner | Tank Cleaner | 12 x 1 Quart                                                                                                     | AB_WAP-014",120,"Case"]
["Adjuvants","AB_WAP-015","Venture Foam Buster","Defoamer","12 x 1 Quart","Venture Foam Buster | Defoamer | 12 x 1 Quart                                                                                                     | AB_WAP-015",120,"Case"]
["Adjuvants","AB_WAP-016","Venture Foamy ","Foam Marker","12 x 1 Quart","Venture Foamy  | Foam Marker | 12 x 1 Quart                                                                                                     | AB_WAP-016",100.25,"Case"]
["Adjuvants","AB_WAP-017","Venture Foamy ","Foam Marker","4 x 1 Gallon","Venture Foamy  | Foam Marker | 4 x 1 Gallon                                                                                                     | AB_WAP-017",104.3,"Gallon"]
["Adjuvants","AB_WAP-018","Venture pHase","pH Spray Tank Conditioner","4 x 1 Gallon","Venture pHase | pH Spray Tank Conditioner | 4 x 1 Gallon                                                                                                     | AB_WAP-018",22.85,"Gallon"]
["Adjuvants","AB_WAP-019","Venture Applicator","Hose End Applicator","Each","Venture Applicator | Hose End Applicator | Each                                                                                                     | AB_WAP-019",108,"Each"]
{"$rows_left_out":382}
{"sheet":"COMAND","index":2,"n_rows":29,"n_cols":7,"rows_kept":29,"cut":false,"hidden":true,"merged":[]}
[]
[]
[]
[]
[]
[]
[]
["Product ID","Item","Package Size","Description","Price / UOM","UOM","Total"]
["CM_WAP-001","Comand Greens Grade Bag","45 lb Bag","Comand 1/16 Greens Grade 45lb Bag",22,"Bag"]
[{"$f":"IF(B10=\"\",\"\",LEFT(A9,7)&TEXT(RIGHT(A9,3)+1,\"000\"))","v":"CM_WAP-002"},"Comand 1/8 Bag","45 lb Bag","Comand 1/8 100 45lb Bag",14,"Bag"]
["CM_WAP-003","Comand 1/8 1000 LB Sack","1000 lb Bag","Comand 1/8 1000 LB Sack",340,"Bag"]
["CM_WAP-004","Comand 1/8in Bulk Truckload","Bulk","Comand 1/8in Bulk",66,"Yard"]
["CM_WAP-005","Comand 1/4 1000 LB Sack","1000 lb Bag","Comand 1/4 1000 LB Sack",330,"Bag"]
["CM_WAP-006","Comand 1/4in Bulk Truckload","Bulk","Comand 1/4in Bulk",45,"Yard"]
["CM_WAP-007","Comand 3/8 1000 LB Sack","1000 lb Bag","Comand 3/8 1000 LB Sack",235,"Bag"]
["CM_WAP-008","Comand 3/8in Bulk Truckload","Bulk","Comand 3/8in Bulk",39,"Yard"]
["CM_WAP-009","Comand 1/2in Bulk Truckload","Bulk","Comand 1/2in Bulk",36,"Yard"]
["CM_WAP-010","Comand 3/4in Bulk Truckload","Bulk","Comand 3/4in Bulk",16.5,"Yard"]
["CM_WAP-011","Comand 1-1/4 AG Grade Truckload","Bulk","Comand 1-1/4 AG Grade",15,"Yard"]
["CM_WAP-012","Comandscape 2.0 CF Bag","2 Cu Ft Bag","Comandscape 2.0 CF Bag",8.6999999999999993,"Bag"]
{"$rows_left_out":10}
{"sheet":"Grigg Brothers","index":3,"n_rows":39,"n_cols":7,"rows_kept":39,"cut":false,"hidden":true,"merged":[]}
[]
[]
[]
[]
[]
[]
[]
["Product ID","Item","Package Size","Description","Price / UOM","UOM","Total"]
["GB_PFL-001","Grigg Turftopia 5-0-5","2x2.5 Gallon","5% N, 5% K, 0.2% Mn, 0.003% Mo, 0.2% Zn",192.5,"Case"]
[{"$f":"IF(B10=\"\",\"\",LEFT(A9,7)&TEXT(RIGHT(A9,3)+1,\"000\"))","v":"GB_PFL-002"},"Grigg A-O-K®","2x2.5 Gallon","A-O-K® 2-0-24",216.25,"Case"]
[{"$f":"IF(B11=\"\",\"\",LEFT(A10,7)&TEXT(RIGHT(A10,3)+1,\"000\"))","v":"GB_PFL-003"},"Grigg Carboplex®","2x2.5 Gallon","Carboplex® 6-4-4",145,"Case"]
["GB_PFL-004","Gary's Green Ultra","2x2.5 Gallon","Gary's Green Ultra 14-2-3",232,"Case"]
["GB_PFL-005","Gary's Green®","2x2.5 Gallon","Gary's Green® 18-3-4 +Fe ",210,"Case"]
["GB_PFL-006","Grigg Iron Combo 1-0-2","2x2.5 Gallon","1-0-2 w/ 0.16%B,0.13%Cu,4%Fe,1%Mn,0.8%Zn",272.5,"Case"]
["GB_PFL-007","Grigg Iron Combo 12-0-0","2x2.5 Gallon","12-0-0 w/ 5%Fe,0.5%Mn,0.5%Zn",95,"Case"]
["GB_PFL-008","Grigg Kelplex™ ","2x2.5 Gallon","Kelplex™ 1-2-2    Ascophyllum nodosum",345,"Case"]
["GB_PFL-009","Grigg Magnesium Complex","2x2.5 Gallon","Mg 5%",218,"Case"]
["GB_PFL-010","Grigg Manganese Combo","2x2.5 Gallon","1.2%Mg,0.4%Cu,5%Mn,1%Zn",242,"Case"]
["GB_PFL-011","Grigg Microburst™","2x2.5 Gallon","1%K,.04%B,.05%Cu,3.4%Fe,2.4%Mn,.01Mo,1%Zn",262.25,"Case"]
["GB_PFL-012","Grigg Nutra Green  5-10-5","2x2.5 Gallon","5-10-5 w/1%Mg,.12%B,.1%Cu,1%Fe,.5%Mn,.1%Zn",223.25,"Case"]
{"$rows_left_out":20}
{"sheet":"GV Water Soluables","index":4,"n_rows":13,"n_cols":7,"rows_kept":13,"cut":false,"hidden":true,"merged":[]}
[]
[]
[]
[]
[]
[null,null,null,"Golf Ventures Water Soluable Fertilizers"]
[]
["Product ID","Item","Package Size","Description","Price/UOM","UOM","Total"]
["GV_WSF-001","GV12636-PFI","25 Lb Bag","12-6-36 Water Soluble Fertilizer",32,"Bag"]
[{"$f":"IF(B10=\"\",\"\",LEFT(A9,7)&TEXT(RIGHT(A9,3)+1,\"000\"))","v":"GV_WSF-002"},"GV202020-PFI","25 Lb Bag","20-20-20 Water Soluble Fertilizer w/ Minors",32,"Bag"]
[{"$f":"IF(B11=\"\",\"\",LEFT(A10,7)&TEXT(RIGHT(A10,3)+1,\"000\"))","v":"GV_WSF-003"},"GV21331-PFI","25 Lb Bag","21-3-31 Water Soluble Fertilizer",32,"Bag"]
[{"$f":"IF(B12=\"\",\"\",LEFT(A11,7)&TEXT(RIGHT(A11,3)+1,\"000\"))","v":""}]
[{"$f":"IF(B13=\"\",\"\",LEFT(A12,7)&TEXT(RIGHT(A12,3)+1,\"000\"))","v":""}]

{"sheet":"Performance Nutritution","index":5,"n_rows":64,"n_cols":7,"rows_kept":64,"cut":false,"hidden":true,"merged":[]}
[]
[]
[]
[]
[]
[]
[]
["Product ID","Item","Package Size","Description","Price/UOM","UOM","Total"]
["PN_KNM-001","Argosy RF","2x2.5 Gallon","Rain-Fast Adjuvant for Pesticide Applications",82.61,"Gallon"]
[{"$f":"IF(B10=\"\",\"\",LEFT(A9,7)&TEXT(RIGHT(A9,3)+1,\"000\"))","v":"PN_KNM-002"},"Vibrant® Green","2x2.5 Gallon","18-3-4 with 1% Fe, 0.1% Mn, Zn & 0.025% B with organic compounds",36.35,"Gallon"]
["PN_KNM-003","Vibrant® Blue","2x2.5 Gallon","15-3-5 with 0.5% Fe, 0.1% Mn, Cu and Zn & 0.025% B plus organic compounds",34.549999999999997,"Gallon"]
["PN_KNM-004","Vibrant® Red","2x2.5 Gallon","3-6-12 with 0.1% Cu, Fe, Mn and Zn, 0.05% Si & 0.025% B plus organic compounds",36.35,"Gallon"]
["PN_KNM-005","Krystal Klear® B","2x2.5 Gallon","5% Boron",29.7,"Gallon"]
["PN_KNM-006","Krystal Klear® Ca","2x2.5 Gallon","3% Calcium",29.7,"Gallon"]
["PN_KNM-007","Krystal Klear® Cu","2x2.5 Gallon","5% Copper",49.3,"Gallon"]
["PN_KNM-008","Krystal Klear® Fe","2x2.5 Gallon","4% Iron",41.1,"Gallon"]
["PN_KMS-001","Krystal Klear® Mg","2x2.5 Gallon","3% Magnesium",46.2,"Gallon"]
[{"$f":"IF(B18=\"\",\"\",LEFT(A17,7)&TEXT(RIGHT(A17,3)+1,\"000\"))","v":"PN_KMS-002"},"Krystal Klear® Mn","2x2.5 Gallon","5% Manganese",43.1,"Gallon"]
["PN_KMS-003","Krystal Klear® ResQ","2x2.5 Gallon","8-0-2 with 2% Fe, 0.5% Mg, 0.5% Mn, 0.25% B, Cu, Zn",52.4,"Gallon"]
["PN_KMS-004","Krystal Klear® Turf Mix","2x2.5 Gallon","3% Fe, 1% Mn, 0.25% Cu, 0.25% B",46.7,"Gallon"]
{"$rows_left_out":45}
{"sheet":"Lebanon","index":6,"n_rows":32,"n_cols":7,"rows_kept":32,"cut":false,"hidden":true,"merged":[]}
[]
[]
[]
[]
[]
[]
[]
["Product ID","Item","Package Size","Description","Price / UOM","UOM","Total"]
["LB_WAP-001","CPR  Premix","2x2.5 Gallon","CPR  Premix Biostimulant 4-0-1",190,"Case"]
[{"$f":"IF(B10=\"\",\"\",LEFT(A9,7)&TEXT(RIGHT(A9,3)+1,\"000\"))","v":"LB_WAP-002"},"CPR  Premix","15 Gallon Drum","CPR  Premix Biostimulant 4-0-1",545,"Drum"]
["LB_WAP-003","PanaSea Plus","2x2.5 Gallon","PanaSea Plus  Seaplant Extract 0-2-2",250,"Case"]
["LB_WAP-004","PanaSea Plus","15 Gallon Drum","PanaSea Plus  Seaplant Extract 0-2-2",600,"Drum"]
["LB_WAP-005","True Foliar N","2x2.5 Gallon","True Foliar N  19-1-6",175,"Case"]
["LB_WAP-006","True Foliar N","15 Gallon Drum","True Foliar N  19-1-6",500,"Drum"]
["LB_WAP-007","True Foliar P","2x2.5 Gallon","True Foliar P  6-12-6",190,"Case"]
["LB_WAP-008","True Foliar P","15 Gallon Drum","True Foliar P  6-12-6",545,"Drum"]
["LB_WAP-009","True Foliar NPK","2x2.5 Gallon","True Foliar NPK  10-3-16",215,"Case"]
["LB_WAP-010","True Foliar NPK","15 Gallon Drum","True Foliar NPK  10-3-16",620,"Drum"]
["LB_WAP-011","True Foliar K","2x2.5 Gallon","True Foliar K  2-0-16",190,"Case"]
["LB_WAP-012","True Foliar K","15 Gallon Drum","True Foliar K  2-0-16",545,"Drum"]
{"$rows_left_out":13}
{"sheet":"Venture Line","index":7,"n_rows":35,"n_cols":7,"rows_kept":35,"cut":false,"hidden":true,"merged":[]}
[]
[]
[]
[]
[]
[]
[]
["Product ID","Item","Package Size","Description","Price / UOM","UOM","Total"]
["VL_WAP-001","GV00142-AME","2 x 2.5 Gallon","Venture CaConditioner (Liquid Gypsum Substitute)",41,"Jug"]
[{"$f":"IF(B10=\"\",\"\",LEFT(A9,7)&TEXT(RIGHT(A9,3)+1,\"000\"))","v":"VL_WAP-002"},"GV00180-AME","265 gal Tote","Venture Ca Conditioner ",18.5,"Gallon"]
["VL_WAP-003","GV00161-AME","2 x 2.5 Gallon","Immerse F Fairway ",75,"Jug"]
["VL_WAP-004","GV00145-AME","275 gal Tote","Immerse F Fairway ",22,"Gallon"]
["VL_WAP-005","GV00172-AME","55 gal Drum","Immerse F Wetting agent",24.27,"Gallon"]
["VL_WAP-006","GV00148-AME","50 LB Bag","Venture Immerse GT Granular",134,"Bag"]
["VL_WAP-007","GV00176-AME","6x8 oz","VG Immerse GT Plus Tablets ",104.6,"Box"]
["VL_WAP-008","GV00135-AME","4 x 1 Gallon","Venture AMS 80/20 Surfactant",17,"Gallon"]
["VL_WAP-009","GV00137-AME","2 x 2.5 Gallon","Venture Cure",200,"Jug"]
["VL_WAP-010","GV00181-AME","30 gal Drum","Venture Cure Fwy ",25.5,"Gallon"]
["VL_WAP-011","GV00143-AME","2 x 2.5 Gallon","Venture Cure Plus",230,"Jug"]
["VL_WAP-012","GV00150-AME","55 gal Drum","Venture Cure Plus ",88.33,"Gal"]
{"$rows_left_out":16}
{"sheet":"Brandt","index":8,"n_rows":111,"n_cols":7,"rows_kept":111,"cut":false,"hidden":true,"merged":[]}
[]
[]
[]
[]
[]
[]
[]
["Product ID","Item","Package Size","Description","Price / UOM","UOM","Total"]
["BR_WAP-001","Summer Success Program ","13 Cases","Nutritional Program for Greens",1250,"Kit"]
[{"$f":"IF(B10=\"\",\"\",LEFT(A9,7)&TEXT(RIGHT(A9,3)+1,\"000\"))","v":"BR_WAP-002"},"Mega-Summer Success Program ","16 Cases","Nutritional Program for Greens + iHammer Megalex",1995,"Kit"]
["BR_WAP-003","Winter Success Program","13 Cases","Nutritional Program for Greens",1250,"Kit"]
["BR_WAP-004","Bi-Monthly Success Program","20 Cases","Nutritional Program for Greens",1650,"Kit"]
["BR_WAP-005","Nematode Kit","15 Cases","8 month control for 3 acres",2600,"Kit"]
["BR_WAP-006","Manni Plex Foli-Cal","2x2.5 Gallon","5% N 10% Ca",130.5,"Case"]
["BR_WAP-007","Manni-Plex Cal Mg","2x2.5 Gallon","7% N, 5.3% Ca, 2.6% Mg",117.5,"Case"]
["BR_WAP-008","Manni-Plex Cal Zn","2x2.5 Gallon","6% N, 6% Ca, 35 Zn",132.5,"Case"]
["BR_WAP-009","Manni-Plex Eagle","2x2.5 Gallon","7% N, 14% K2O, 0.5% Mg, 0.5% Fe, 0.25% Mn",162.5,"Case"]
["BR_WAP-010","Manni-Plex Fe","2x2.5 Gallon","5% N, 5% Fe",113,"Case"]
["BR_WAP-011","Manni-Plex Grow","2x2.5 Gallon","12% N, 6% K2O, 0.25% Mg, 0.12% Cu, 1% Fe, 0.25% Mn, 0.25% Zn",152.5,"Case"]
["BR_WAP-012","Manni-Plex K","2x2.5 Gallon","20% K20",144,"Case"]
{"$rows_left_out":92}
{"sheet":"Earthworks","index":9,"n_rows":35,"n_cols":7,"rows_kept":35,"cut":false,"hidden":true,"merged":[]}
[]
[]
[]
[]
[]
[]
[]
["Product ID","Item","Package Size","Description","Price / UOM","UOM","Total"]
["ZZ_EWP-001","3-4-3  Replenish G.G.","50 Lb Bag","100% organic egg layer poultry compost",17,"Bag"]
[{"$f":"IF(B10=\"\",\"\",LEFT(A9,7)&TEXT(RIGHT(A9,3)+1,\"000\"))","v":"ZZ_EWP-002"},"3-4-3  Replenish G.G.","500 Lb ","100% organic egg layer poultry compost",171.25,"Bag"]
["ZZ_EWP-003","Ecolite soil amendment GG","1000 Lb ","Zeolite mineral soil amendment GG",360,"Bag"]
["ZZ_EWP-004","Ecolite soil amendment GG","50 Lb Bag","Zeolite mineral soil amendment GG",18,"Bag"]
["ZZ_EWP-005","Myco Replenish 3-3-3 GG ","50 Lb Bag","Endo and ecto mycorrhizae fungi",37,"Bag"]
["ZZ_EWP-006","Myco Replenish 3-3-3 GG ","500 Lb Bag","Endo and ecto mycorrhizae fungi",1490,"Ton"]
["ZZ_EWP-007","Renovate Plus 1-0-1 G.G.","1000 Lb ","Endo and ecto mycorrhizae fungi",1550,"Ton"]
["ZZ_EWP-008","Renovate Plus 1-0-1 GG","50 Lb Bag","Blend of carbon and mineral amendments",41,"Bag"]
["ZZ_EWP-009","Replenish 10-2-5 Fairway Grade","50 Lb Bag","50% water insoluble nitrogen fertilizer",32,"Bag"]
["ZZ_EWP-010","Replenish 10-2-5 Fairway Grade","50 Lb Bag","50% water insoluble nitrogen fertilizer",35,"Bag"]
["ZZ_EWP-011","Replenish 5-4-5 GG ","50 Lb Bag","Composted poultry manure",31,"Bag"]
["ZZ_EWP-012","Replenish 8-2-2 ","50 LB Bag","SGN 150 fairway grade",23,"Bag"]
{"$rows_left_out":16}
{"sheet":"Turf Protection","index":10,"n_rows":69,"n_cols":7,"rows_kept":69,"cut":false,"hidden":true,"merged":[]}
[]
[]
[]
[]
[]
[]
[]
["Product ID","Item","Package Size","Description","Price / UOM","UOM","Total"]
["TP_WAP-001","Proplant","1 Gallon","Banol®",420,"Gallon"]
[{"$f":"IF(B10=\"\",\"\",LEFT(A9,7)&TEXT(RIGHT(A9,3)+1,\"000\"))","v":"TP_WAP-002"},"Iprodione 2F","2x2.5 Gallon","Chipco 26019®",166.7,"Gallon"]
["TP_WAP-003","Fosetyl-Al 80%","11 Lb","Chipco Signature®",19.75,"Pound"]
["TP_WAP-004","Thiophanate Methyl 46.2%","2x2.5 Gallon","Cleary's 3336®",143.33000000000001,"Jug"]
["TP_WAP-005","Chlorothalonil 82.5DF ","2x10 Lb","Daconil Ultrex®",108.87,"Bag"]
["TP_WAP-006","Chlorothalonil 720 ","2x2.5 Gallon","Daconil Weatherstik®",140,"Jug"]
["TP_WAP-007","Manzate Max T&O","2x2.5 Gallon","Dithane®",109,"Jug"]
["TP_WAP-008","Manzate Pro-Stick T&O","48 Lb","Dithane®",5.8,"Pound"]
["TP_WAP-009","Azoxystrobin/Propiconazole","1 Gallon","Headway®",276.64999999999998,"Gallon"]
["TP_WAP-010","Azoxystrobin 50 WDG ","6x1 Lb","Heritage® 50 WDG",185,"Pound"]
["TP_WAP-011","Azoxystrobin 2SC","1 Gallon","Heritage® TL",426.6,"Gallon"]
["TP_WAP-012","Azoxystrobin/Tebuconazole","1 Gallon","PrimeSource™ Exclusive",385,"Gallon"]
{"$rows_left_out":50}
{"sheet":"Adjuvants","index":11,"n_rows":69,"n_cols":7,"rows_kept":69,"cut":false,"hidden":true,"merged":[]}
[]
[]
[]
[]
[]
[]
[]
["Product ID","Item","Package Size","Description","Price / UOM","UOM","Total"]
["AB_WAP-001","80/20 Select™","2 x 2.5 Gallon","80% Nonionic Surfactant",19.7,"Gallon"]
[{"$f":"IF(B10=\"\",\"\",LEFT(A9,7)&TEXT(RIGHT(A9,3)+1,\"000\"))","v":"AB_WAP-002"},"Defoamer Select™","12x1 Quart","Defoamer",160.19999999999999,"Case"]
[{"$f":"IF(B11=\"\",\"\",LEFT(A10,7)&TEXT(RIGHT(A10,3)+1,\"000\"))","v":"AB_WAP-003"},"Duo Stick Select™","2 x 2.5 Gallon","MSO + Organosilicone Blend",88.45,"Jug"]
["AB_WAP-004","Foam Marker Select™","12x1 Quart","Foam Marker",197.14,"Case"]
["AB_WAP-005","Masking Agent Select™","12x1 Quart","Masking Agent (Winter Green)",420,"Case"]
["AB_WAP-006","MSO Select™","2 x 2.5 Gallon","Methylated Seed Oil",64.25,"Jug"]
["AB_WAP-007","PS 804 Select™","2 x 2.5 Gallon","Similar to LI 700®",75,"Jug"]
["AB_WAP-008","Tank Cleaner Select™","12x1 Quart","Tank Cleaner",157.19999999999999,"Case"]
["AB_WAP-009","TPC - Turf Tech Turf Pigment Cleaner ","12x16 Oz","Turf Colorant Cleaner/Remover",144,"Case"]
["AB_WAP-010","Triple Max Select™","4 x 1 Gallon","H20 Conditioner/Acidifer/Surfactant",37.85,"Gallon"]
["AB_WAP-011","Turf Tech MPC","12x16 Oz","Multi-Purpose Cleaner",59,"Case"]
["AB_WAP-012","Turf Tech Tank Wash","2 x 2.5 Gallon","Tank Cleaner",157.19999999999999,"Case"]
{"$rows_left_out":49}