{"text_format":"1","workbook":"xlsx","n_sheets":11,"sheets":["EOP Order Form","ProductList","Aqua Aid","COMAND","Bio Mas","GV Water Soluble","Brandt","Grigg Brothers","Emerald Isle","Performance Nutritution","Select Source"],"not_rendered":{"charts":0,"images":7,"macros":1,"external_links":0,"defined_names":2,"comments":0,"pivot_tables":0},"unopened":[],"bounds":{"document_bytes":16777216,"sheet_cells":100000,"rows_first":2000,"rows_last":500,"rows_between":2000,"halvings":0,"cell_chars":16384,"cell_head_chars":4096},"cells_cut":0,"cells_raw":0,"read":"whole","date_system":"1900"}

{"sheet":"EOP Order Form","index":0,"n_rows":53,"n_cols":54,"rows_kept":53,"cut":false,"hidden":false,"merged":[[46,6,46,7],[47,6,47,7],[1,6,2,8],[3,7,3,8],[4,7,4,8],[5,7,5,8],[6,7,6,8],[7,7,7,8],[8,7,8,8],[9,7,9,8],[10,7,10,8],[11,7,11,8],[12,7,12,8],[5,1,5,2],[6,1,6,2],[7,1,7,2],[8,1,8,2],[45,6,45,7]]}
[]
[null,null,null,null,null,null,"Customer Information"]
[]
[null,null,null,null,null,null,"PO :"]
[null,null,null,null,null,null,"Name :"]
[null,"Golf Ventures",null,null,null,null,"Company Name :"]
[null,"5385 Gateway Blvd STE 12",null,null,null,null," Email :"]
[null,"Lakeland FL 33811",null,null,null,null,"Phone :"]
[null,"863-665-5800 | (866) 853-4653",null,null,null,null," Address 1 :"]
[null,null,null,null,null,null,"Address 2 :"]
[null,"Order No. :",null,null,null,null,"City :"]
[null,null,null,null,null,null,"State :"]
[null,"Order Date :",null,null,null,null,"Zip :"]
[]
[null,"Quantity","Vendor","Item","Description","Package Size","Price / UOM","UOM","Total",null,null,null,null,null,null,null,null,null,null,null,null,null,null,null,null,null,null,null,null,null,null,null,null,null,null,null,null,null,null,null,null,null,null,null,null,null,null,null,null,null,null,null,null,"Product ID"]
[null,null,null,{"$f":"IFERROR(INDEX(INDIRECT(\"'\"&$C16&\"'!\"&\"$B$9:$B$500\"),MATCH(RIGHT($BB16,10),INDIRECT(\"'\"&$C16&\"'!\"&\"$A$9:$A$500\"),0),),\"\")","v":""},{"$f":"IFERROR(INDEX(INDIRECT(\"'\"&$C16&\"'!\"&\"$D$9:$D$500\"),MATCH(RIGHT($BB16,10),INDIRECT(\"'\"&$C16&\"'!\"&\"$A$9:$A$500\"),0),),\"\")","v":""},{"$f":"IFERROR(INDEX(INDIRECT(\"'\"&$C16&\"'!\"&\"$C$9:$C$500\"),MATCH(RIGHT($BB16,10),INDIRECT(\"'\"&$C16&\"'!\"&\"$A$9:$A$500\"),0),),\"\")","v":""},{"$f":"IFERROR(INDEX(INDIRECT(\"'\"&$C16&\"'!\"&\"$E$9:$E$500\"),MATCH(RIGHT($BB16,10),INDIRECT(\"'\"&$C16&\"'!\"&\"$A$9:$A$500\"),0),),\"\")","v":""},{"$f":"IFERROR(INDEX(INDIRECT(\"'\"&$C16&\"'!\"&\"$F$9:$F$500\"),MATCH(RIGHT($BB16,10),INDIRECT(\"'\"&$C16&\"'!\"&\"$A$9:$A$500\"),0),),\"\")","v":""},{"$f":"IF(B16=\"\",\"\",(G16*B16))","v":""}]
[null,null,null,{"$f":"IFERROR(INDEX(INDIRECT(\"'\"&$C17&\"'!\"&\"$B$9:$B$500\"),MATCH(RIGHT($BB17,10),INDIRECT(\"'\"&$C17&\"'!\"&\"$A$9:$A$500\"),0),),\"\")","v":""},{"$f":"IFERROR(INDEX(INDIRECT(\"'\"&$C17&\"'!\"&\"$D$9:$D$500\"),MATCH(RIGHT($BB17,10),INDIRECT(\"'\"&$C17&\"'!\"&\"$A$9:$A$500\"),0),),\"\")","v":""},{"$f":"IFERROR(INDEX(INDIRECT(\"'\"&$C17&\"'!\"&\"$C$9:$C$500\"),MATCH(RIGHT($BB17,10),INDIRECT(\"'\"&$C17&\"'!\"&\"$A$9:$A$500\"),0),),\"\")","v":""},{"$f":"IFERROR(INDEX(INDIRECT(\"'\"&$C17&\"'!\"&\"$E$9:$E$500\"),MATCH(RIGHT($BB17,10),INDIRECT(\"'\"&$C17&\"'!\"&\"$A$9:$A$500\"),0),),\"\")","v":""},{"$f":"IFERROR(INDEX(INDIRECT(\"'\"&$C17&\"'!\"&\"$F$9:$F$500\"),MATCH(RIGHT($BB17,10),INDIRECT(\"'\"&$C17&\"'!\"&\"$A$9:$A$500\"),0),),\"\")","v":""},{"$f":"IF(B17=\"\",\"\",(G17*B17))","v":""}]
[null,null,null,{"$f":"IFERROR(INDEX(INDIRECT(\"'\"&$C18&\"'!\"&\"$B$9:$B$500\"),MATCH(RIGHT($BB18,10),INDIRECT(\"'\"&$C18&\"'!\"&\"$A$9:$A$500\"),0),),\"\")","v":""},{"$f":"IFERROR(INDEX(INDIRECT(\"'\"&$C18&\"'!\"&\"$D$9:$D$500\"),MATCH(RIGHT($BB18,10),INDIRECT(\"'\"&$C18&\"'!\"&\"$A$9:$A$500\"),0),),\"\")","v":""},{"$f":"IFERROR(INDEX(INDIRECT(\"'\"&$C18&\"'!\"&\"$C$9:$C$500\"),MATCH(RIGHT($BB18,10),INDIRECT(\"'\"&$C18&\"'!\"&\"$A$9:$A$500\"),0),),\"\")","v":""},{"$f":"IFERROR(INDEX(INDIRECT(\"'\"&$C18&\"'!\"&\"$E$9:$E$500\"),MATCH(RIGHT($BB18,10),INDIRECT(\"'\"&$C18&\"'!\"&\"$A$9:$A$500\"),0),),\"\")","v":""},{"$f":"IFERROR(INDEX(INDIRECT(\"'\"&$C18&\"'!\"&\"$F$9:$F$500\"),MATCH(RIGHT($BB18,10),INDIRECT(\"'\"&$C18&\"'!\"&\"$A$9:$A$500\"),0),),\"\")","v":""},{"$f":"IF(B18=\"\",\"\",(G18*B18))","v":""}]
[null,null,null,{"$f":"IFERROR(INDEX(INDIRECT(\"'\"&$C19&\"'!\"&\"$B$9:$B$500\"),MATCH(RIGHT($BB19,10),INDIRECT(\"'\"&$C19&\"'!\"&\"$A$9:$A$500\"),0),),\"\")","v":""},{"$f":"IFERROR(INDEX(INDIRECT(\"'\"&$C19&\"'!\"&\"$D$9:$D$500\"),MATCH(RIGHT($BB19,10),INDIRECT(\"'\"&$C19&\"'!\"&\"$A$9:$A$500\"),0),),\"\")","v":""},{"$f":"IFERROR(INDEX(INDIRECT(\"'\"&$C19&\"'!\"&\"$C$9:$C$500\"),MATCH(RIGHT($BB19,10),INDIRECT(\"'\"&$C19&\"'!\"&\"$A$9:$A$500\"),0),),\"\")","v":""},{"$f":"IFERROR(INDEX(INDIRECT(\"'\"&$C19&\"'!\"&\"$E$9:$E$500\"),MATCH(RIGHT($BB19,10),INDIRECT(\"'\"&$C19&\"'!\"&\"$A$9:$A$500\"),0),),\"\")","v":""},{"$f":"IFERROR(INDEX(INDIRECT(\"'\"&$C19&\"'!\"&\"$F$9:$F$500\"),MATCH(RIGHT($BB19,10),INDIRECT(\"'\"&$C19&\"'!\"&\"$A$9:$A$500\"),0),),\"\")","v":""},{"$f":"IF(B19=\"\",\"\",(G19*B19))","v":""}]
[null,null,null,{"$f":"IFERROR(INDEX(INDIRECT(\"'\"&$C20&\"'!\"&\"$B$9:$B$500\"),MATCH(RIGHT($BB20,10),INDIRECT(\"'\"&$C20&\"'!\"&\"$A$9:$A$500\"),0),),\"\")","v":""},{"$f":"IFERROR(INDEX(INDIRECT(\"'\"&$C20&\"'!\"&\"$D$9:$D$500\"),MATCH(RIGHT($BB20,10),INDIRECT(\"'\"&$C20&\"'!\"&\"$A$9:$A$500\"),0),),\"\")","v":""},{"$f":"IFERROR(INDEX(INDIRECT(\"'\"&$C20&\"'!\"&\"$C$9:$C$500\"),MATCH(RIGHT($BB20,10),INDIRECT(\"'\"&$C20&\"'!\"&\"$A$9:$A$500\"),0),),\"\")","v":""},{"$f":"IFERROR(INDEX(INDIRECT(\"'\"&$C20&\"'!\"&\"$E$9:$E$500\"),MATCH(RIGHT($BB20,10),INDIRECT(\"'\"&$C20&\"'!\"&\"$A$9:$A$500\"),0),),\"\")","v":""},{"$f":"IFERROR(INDEX(INDIRECT(\"'\"&$C20&\"'!\"&\"$F$9:$F$500\"),MATCH(RIGHT($BB20,10),INDIRECT(\"'\"&$C20&\"'!\"&\"$A$9:$A$500\"),0),),\"\")","v":""},{"$f":"IF(B20=\"\",\"\",(G20*B20))","v":""}]
{"$rows_left_out":34}
{"sheet":"ProductList","index":1,"n_rows":254,"n_cols":8,"rows_kept":254,"cut":false,"hidden":true,"merged":[]}
["Sheet Names","Product ID","Item","Description","Package Size","Product List","Price / UOM","UOM"]
["Aqua Aid","AA_WAP-001","Aqua-Aid Liquid","Aqua-Aid Wetting Agent (Penetrate)","2x2.5 Gallon","Aqua-Aid Liquid | Aqua-Aid Wetting Agent (Penetrate) | 2x2.5 Gallon                                                                                                     | AA_WAP-001",157,"Case"]
["Aqua Aid","AA_WAP-002","Aqua-Aid Pellets","Aqua-Aid Wetting Agent (Penetrate)","24, 8oz Pellets","Aqua-Aid Pellets | Aqua-Aid Wetting Agent (Penetrate) | 24, 8oz Pellets                                                                                                     | AA_WAP-002",225,"Box"]
["Aqua Aid","AA_WAP-003","Aquifer Liquid","Soil Surfactant  (Hydrate)","2x2.5 Gallon","Aquifer Liquid | Soil Surfactant  (Hydrate) | 2x2.5 Gallon                                                                                                     | AA_WAP-003",343,"Case"]
["Aqua Aid","AA_WAP-004","OARS PS Liquid","Penetrating Branched Soil Surfactant (Corrective)","2x2.5 Gallon","OARS PS Liquid | Penetrating Branched Soil Surfactant (Corrective) | 2x2.5 Gallon                                                                                                     | AA_WAP-004",462,"Case"]
["Aqua Aid","AA_WAP-005","OARS HS Liquid","Hydrating Branched Soil Surfactant (Corrective)","2x2.5 Gallon","OARS HS Liquid | Hydrating Branched Soil Surfactant (Corrective) | 2x2.5 Gallon                                                                                                     | AA_WAP-005",471,"Case"]
["Aqua Aid","AA_WAP-006","AQM Pellets","Wetting Agent w/Kelp Extract (Repair and Root)","12, 8oz Pellets","AQM Pellets | Wetting Agent w/Kelp Extract (Repair and Root) | 12, 8oz Pellets                                                                                                     | AA_WAP-006",274,"Box"]
["Bio Mas","GV_BIO-001","BioMAS G","Bio-Más G","25 lb Pail","BioMAS G | Bio-Más G | 25 lb Pail                                                                                                     | GV_BIO-001",800,"Pail"]
["Bio Mas","GV_BIO-002","BioMAS-G","Bio-Más G","25 lb Pail","BioMAS-G | Bio-Más G | 25 lb Pail                                                                                                     | GV_BIO-002",800,"Pail"]
["Brandt","BT_INV-001","Summer Success Program ","Nutritional Program for Greens","12 cases","Summer Success Program  | Nutritional Program for Greens | 12 cases                                                                                                     | BT_INV-001",1250,"Kit"]
["Brandt","BT_INV-002","Winter Success Program","Nutritional Program for Greens","13 cases","Winter Success Program | Nutritional Program for Greens | 13 cases                                                                                                     | BT_INV-002",1250,"Kit"]
["Brandt","BT_INV-003","Nematode Kit","8 month control for 3 acres","15 cases","Nematode Kit | 8 month control for 3 acres | 15 cases                                                                                                     | BT_INV-003",2500,"Kit"]
["Brandt","BT_INV-004","Brandt Noculate® Liquid","Microbial Inoculate plus Humic Acid and Kelp","2 x 2.5 gal","Brandt Noculate® Liquid | Microbial Inoculate plus Humic Acid and Kelp | 2 x 2.5 gal                                                                                                     | BT_INV-004",220,"case"]
["Brandt","BT_INV-005","Brandt Uptake 12","12% Humic substances (Leonardite)","2 x 2.5 gal","Brandt Uptake 12 | 12% Humic substances (Leonardite) | 2 x 2.5 gal                                                                                                     | BT_INV-005",90,"case"]
["Brandt","BT_INV-006","Brandt Uptake Advanced","8% Humic Acid Devired from Leonardite Ore","2 x 2.5 gal","Brandt Uptake Advanced | 8% Humic Acid Devired from Leonardite Ore | 2 x 2.5 gal                                                                                                     | BT_INV-006",129,"case"]
["Brandt","BT_INV-007","Brandt Uptake Starter","4% N, 1% P, 4% S","2 x 2.5 gal","Brandt Uptake Starter | 4% N, 1% P, 4% S | 2 x 2.5 gal                                                                                                     | BT_INV-007",122.5,"case"]
["Brandt","BT_INV-008","Leonardite Plus Fine","80% Humic Acid","44 lb bag","Leonardite Plus Fine | 80% Humic Acid | 44 lb bag                                                                                                     | BT_INV-008",1.1000000000000001,"lb"]
["Brandt","BT_INV-009","Leonardite Plus Granular (OMRI LISTED)","65% Humic Acid","50 lb bag","Leonardite Plus Granular (OMRI LISTED) | 65% Humic Acid | 50 lb bag                                                                                                     | BT_INV-009",1,"lb"]
["Brandt","BT_INV-010","Brandt Seaweed Max","Seaweed Extra With Humic Acid","2 x 2.5 gal","Brandt Seaweed Max | Seaweed Extra With Humic Acid | 2 x 2.5 gal                                                                                                     | BT_INV-010",270,"case"]
["Brandt","BT_INV-011","Brandt Humi-Cal","1.5% Ca, 6% Humic Acid, 2% Salicylic Acid","2 x 2.5 gal","Brandt Humi-Cal | 1.5% Ca, 6% Humic Acid, 2% Salicylic Acid | 2 x 2.5 gal                                                                                                     | BT_INV-011",110,"case"]
{"$rows_left_out":235}
{"sheet":"Aqua Aid","index":2,"n_rows":35,"n_cols":7,"rows_kept":35,"cut":false,"hidden":true,"merged":[]}
[]
[]
[]
[]
[]
[]
[]
["Product ID","Item","Package Size","Description","Price / UOM","UOM","Total"]
["AA_WAP-001","Aqua-Aid Liquid","2x2.5 Gallon","Aqua-Aid Wetting Agent (Penetrate)",157,"Case"]
[{"$f":"IF(B10=\"\",\"\",LEFT(A9,7)&TEXT(RIGHT(A9,3)+1,\"000\"))","v":"AA_WAP-002"},"Aqua-Aid Pellets","24, 8oz Pellets","Aqua-Aid Wetting Agent (Penetrate)",225,"Box"]
["AA_WAP-003","Aquifer Liquid","2x2.5 Gallon","Soil Surfactant  (Hydrate)",343,"Case"]
["AA_WAP-004","OARS PS Liquid","2x2.5 Gallon","Penetrating Branched Soil Surfactant (Corrective)",462,"Case"]
["AA_WAP-005","OARS HS Liquid","2x2.5 Gallon","Hydrating Branched Soil Surfactant (Corrective)",471,"Case"]
["AA_WAP-006","AQM Pellets","12, 8oz Pellets","Wetting Agent w/Kelp Extract (Repair and Root)",274,"Box"]
[""]
[""]
[""]
[""]
[""]
[""]
{"$rows_left_out":16}
{"sheet":"COMAND","index":3,"n_rows":35,"n_cols":7,"rows_kept":35,"cut":false,"hidden":true,"merged":[]}
[]
[]
[]
[]
[]
[]
[]
["Product ID","Item","Package Size","Description","Price / UOM","UOM","Total"]
["LS_COM-001","7030DIVOT-GAS","2000 Lb Bag","70/30 COMAND Green Divot Mix",190,"Tote"]
[{"$f":"IF(B10=\"\",\"\",LEFT(A9,7)&TEXT(RIGHT(A9,3)+1,\"000\"))","v":"LS_COM-002"},"COMAND 1/8 100-LIF","(40) X 45 Lb Bag","40 X COMAND 1/8 45 Lb Bags",560,"Pallet"]
["LS_COM-003","COMAND 1/8 100 SACK-LIF","1000 Lb Bag","COMAND 1/8 1000 Lb Sack",330,"Tote"]
[""]
[""]
[""]
[""]
[""]
[""]
[""]
[""]
[""]
{"$rows_left_out":16}
{"sheet":"Bio Mas","index":4,"n_rows":35,"n_cols":7,"rows_kept":35,"cut":false,"hidden":true,"merged":[]}
[]
[]
[]
[]
[]
[]
[]
["Product ID","Item","Package Size","Description","Price / UOM","UOM","Total"]
["GV_BIO-001","BioMAS G","25 lb Pail","Bio-Más G",800,"Pail"]
[{"$f":"IF(B10=\"\",\"\",LEFT(A9,7)&TEXT(RIGHT(A9,3)+1,\"000\"))","v":"GV_BIO-002"},"BioMAS-G","25 lb Pail","Bio-Más G",800,"Pail"]
[""]
[""]
[""]
[""]
[""]
[""]
[""]
[""]
[""]
[""]
{"$rows_left_out":16}
{"sheet":"GV Water Soluble","index":5,"n_rows":35,"n_cols":7,"rows_kept":35,"cut":false,"hidden":true,"merged":[]}
[]
[]
[]
[]
[]
[]
[]
["Product ID","Item","Package Size","Description","Price / UOM","UOM","Total"]
["GV_WSF-001","GV12636-PFI","25 Lb. Bag","12-6-36 Water Soluble Fertilizer",29,"Bag"]
[{"$f":"IF(B10=\"\",\"\",LEFT(A9,7)&TEXT(RIGHT(A9,3)+1,\"000\"))","v":"GV_WSF-002"},"GV202020-PFI","25 Lb. Bag","20-20-20 Water Soluble Fertilizer w/ Minors",28,"Bag"]
["GV_WSF-003","GV21331-PFI","25 Lb. Bag","21-3-31 Water Soluble Fertilizer",28.5,"Bag"]
[""]
[""]
[""]
[""]
[""]
[""]
[""]
[""]
[""]
{"$rows_left_out":16}
{"sheet":"Brandt","index":6,"n_rows":93,"n_cols":7,"rows_kept":93,"cut":false,"hidden":true,"merged":[]}
[]
[]
[]
[]
[]
[]
[]
["Product ID","Item","Package Size","Description","Price / UOM","UOM","Total"]
["BT_INV-001","Summer Success Program ","12 cases","Nutritional Program for Greens",1250,"Kit"]
[{"$f":"IF(B10=\"\",\"\",LEFT(A9,7)&TEXT(RIGHT(A9,3)+1,\"000\"))","v":"BT_INV-002"},"Winter Success Program","13 cases","Nutritional Program for Greens",1250,"Kit"]
["BT_INV-003","Nematode Kit","15 cases","8 month control for 3 acres",2500,"Kit"]
["BT_INV-004","Brandt Noculate® Liquid","2 x 2.5 gal","Microbial Inoculate plus Humic Acid and Kelp",220,"case"]
["BT_INV-005","Brandt Uptake 12","2 x 2.5 gal","12% Humic substances (Leonardite)",90,"case"]
["BT_INV-006","Brandt Uptake Advanced","2 x 2.5 gal","8% Humic Acid Devired from Leonardite Ore",129,"case"]
["BT_INV-007","Brandt Uptake Starter","2 x 2.5 gal","4% N, 1% P, 4% S",122.5,"case"]
["BT_INV-008","Leonardite Plus Fine","44 lb bag","80% Humic Acid",1.1000000000000001,"lb"]
["BT_INV-009","Leonardite Plus Granular (OMRI LISTED)","50 lb bag","65% Humic Acid",1,"lb"]
["BT_INV-010","Brandt Seaweed Max","2 x 2.5 gal","Seaweed Extra With Humic Acid",270,"case"]
["BT_INV-011","Brandt Humi-Cal","2 x 2.5 gal","1.5% Ca, 6% Humic Acid, 2% Salicylic Acid",110,"case"]
["BT_INV-012","Brandt In-Cyte","2 x 2.5 gal","3-12-0 plus Humic Acid, Seaweed Extract, Wetting Agent",100,"case"]
{"$rows_left_out":74}
{"sheet":"Grigg Brothers","index":7,"n_rows":40,"n_cols":8,"rows_kept":40,"cut":false,"hidden":true,"merged":[]}
[]
[]
[]
[]
[]
[]
[]
["Product ID","Item","Package Size","Description","Price / UOM","UOM","Total"]
["GB_PFL-001","Sili Kal B™","2x2.5 Gallon","Sili Kal B™ 8-0-4   ",270.3,"Case",null,"Proven Foliar Liquids"]
[{"$f":"IF(B10=\"\",\"\",LEFT(A9,7)&TEXT(RIGHT(A9,3)+1,\"000\"))","v":"GB_PFL-002"},"A-O-K®","2x2.5 Gallon","A-O-K® 1-0-25",211.25,"Case",null,"Proven Foliar Liquids"]
[{"$f":"IF(B11=\"\",\"\",LEFT(A10,7)&TEXT(RIGHT(A10,3)+1,\"000\"))","v":"GB_PFL-003"},"Microburst™","2x2.5 Gallon","Microburst™ 0-0-1",247.5,"Case",null,"Proven Foliar Liquids"]
["GB_PFL-004","Gary's Green Ultra","2x2.5 Gallon","Gary's Green Ultra 13-2-3 +Fe",220.6,"Case",null,"Proven Foliar Liquids"]
["GB_PFL-005","Gary's Green®","2x2.5 Gallon","Gary's Green® 18-3-4 +Fe ",201.45,"Case",null,"Proven Foliar Liquids"]
["GB_PFL-006","Suprema®","2x2.5 Gallon","Suprema® 12-0-12",191.25,"Case",null,"Proven Foliar Liquids"]
["GB_PFL-007","Ultraplex®","2x2.5 Gallon","Ultraplex® 4-0-3 ",262.64999999999998,"Case",null,"Proven Foliar Liquids"]
["GB_PFL-008","P-K Plus®","2x2.5 Gallon","P-K Plus® 3-7-18 ",283.05,"Case",null,"Proven Foliar Liquids"]
["GB_PFL-009","Tuff Turf®","2x2.5 Gallon","Tuff Turf® 1-0-14 ",288.14999999999998,"Case",null,"Proven Foliar Liquids"]
["GB_PFL-010","Low N Plus™","2x2.5 Gallon","Low N Plus™ 1-6-12",191.25,"Case",null,"Proven Foliar Liquids"]
["GB_PFL-011","Kelplex™ ","2x2.5 Gallon","Kelplex™ 1-2-2    ",341.7,"Case",null,"Proven Foliar Liquids"]
["GB_PFL-012","Iron Combo Chelate 4%®","2x2.5 Gallon","Iron Combo Chelate 4%®",260,"Case",null,"Proven Foliar Liquids"]
{"$rows_left_out":21}
{"sheet":"Emerald Isle","index":8,"n_rows":28,"n_cols":7,"rows_kept":28,"cut":false,"hidden":true,"merged":[]}
[]
[]
[]
[]
[]
[]
[]
["Product ID","Item","Package Size","Description","Price/UOM","UOM","Total"]
["EI_CPR-001",3118800,"2x2.5 Gallon","CPR  Premix Biostimulant 4-0-1",244,"Case"]
[{"$f":"IF(B10=\"\",\"\",LEFT(A9,7)&TEXT(RIGHT(A9,3)+1,\"000\"))","v":"EI_CPR-002"},3118801,"15 Gal Drum","CPR  Premix Biostimulant 4-0-1",685,"Drum"]
["EI_CPR-003",3118802,"2x2.5 Gallon","PanaSea Plus  Seaplant Extract 0-2-2",373,"Case"]
["EI_CPR-004",3118803,"15 Gal Drum","PanaSea Plus  Seaplant Extract 0-2-2",1040,"Drum"]
["EI_CPR-005",3118805,"2x2.5 Gallon","True Foliar N  19-1-6",210,"Case"]
["EI_CPR-006",3118806,"15 Gal Drum","True Foliar N  19-1-6",605,"Drum"]
["EI_CPR-007",3118807,"2x2.5 Gallon","True Foliar P  6-12-6",224,"Case"]
["EI_CPR-008",3118808,"15 Gal Drum","True Foliar P  6-12-6",626,"Drum"]
["EI_CPR-009",3118809,"2x2.5 Gallon","True Foliar NPK  10-3-16",255,"Case"]
["EI_CPR-010",3118810,"15 Gal Drum","True Foliar NPK  10-3-16",725,"Drum"]
["EI_CPR-011",3118811,"2x2.5 Gallon","True Foliar K  2-0-16",255,"Case"]
["EI_CPR-012",3118812,"15 Gal Drum","True Foliar K  2-0-16",727,"Drum"]
{"$rows_left_out":9}
{"sheet":"Performance Nutritution","index":9,"n_rows":62,"n_cols":8,"rows_kept":62,"cut":false,"hidden":true,"merged":[]}
[]
[]
[]
[]
[]
[]
[]
["Product ID","Item","Package Size","Description","Price/UOM","UOM","Total"]
["PN_AEA-001","Argosy RF","2x2.5 Gallon","Rain-Fast Adjuvant for Pesticide Applications",65,"Gallon",null,"Argosy™ Patented Rain-Fast, Elastic Adjuvants"]
[{"$f":"IF(B10=\"\",\"\",LEFT(A9,7)&TEXT(RIGHT(A9,3)+1,\"000\"))","v":""}]
["PN_BWC-001","Black Castings","40 Lb Bag","OMRI Listed Wormj Castings, 1-0.5-.05+1%Ca",0.81,"Lb",null,"Black Castings™ Premioum Worm Castings"]
[{"$f":"IF(B12=\"\",\"\",LEFT(A11,7)&TEXT(RIGHT(A11,3)+1,\"000\"))","v":""}]
["PN_KNM-001","KaPre® Embella","2x2.5 Gallon","Patented Soil Amendment",60,"Gallon",null,"KaPre®  Liquid Soil Amendments - Surfactants - Nutrients for Microbes"]
[{"$f":"IF(B14=\"\",\"\",LEFT(A13,7)&TEXT(RIGHT(A13,3)+1,\"000\"))","v":"PN_KNM-002"},"KaPre® ExAlt","2x2.5 Gallon","Soil Surfactant & Fertilizer Additive",98,"Gallon",null,"KaPre®  Liquid Soil Amendments - Surfactants - Nutrients for Microbes"]
["PN_KNM-003","KaPre® KelpPlus","2x2.5 Gallon","Sea Kelp plus 17 Amino Acids and Vitamin C",30,"Gallon",null,"KaPre®  Liquid Soil Amendments - Surfactants - Nutrients for Microbes"]
["PN_KNM-004","KaPre® PhoNix","2x2.5 Gallon","Patented Stress-Fighting Solution",120,"Gallon",null,"KaPre®  Liquid Soil Amendments - Surfactants - Nutrients for Microbes"]
["PN_KNM-005","KaPre® ProCreate","2x2.5 Gallon","Patented NPK Solution with micros and PO3",46,"Gallon",null,"KaPre®  Liquid Soil Amendments - Surfactants - Nutrients for Microbes"]
["PN_KNM-006","KaPre® Spectra","2x2.5 Gallon","Concentrated Fulvic Acid Solution",100,"Gallon",null,"KaPre®  Liquid Soil Amendments - Surfactants - Nutrients for Microbes"]
["PN_KNM-007","KaPre® RemeD8-WSP & KaPre® Activ8","2x2.5 Gallon","Patented Soil Amendment & Fertilizer Additive",94,"Gallon",null,"KaPre®  Liquid Soil Amendments - Surfactants - Nutrients for Microbes"]
[""]
{"$rows_left_out":43}
{"sheet":"Select Source","index":10,"n_rows":77,"n_cols":8,"rows_kept":77,"cut":false,"hidden":true,"merged":[]}
[]
[]
[]
[]
[]
[]
[]
["Product ID","Item","Package Size","Description","Price / UOM","UOM","Total"]
["SS_FNG-001","Azoxy 50 WDG Select™","1 #","Alternative for: Heritage® 50 WDG",168.8,"LB",null,"Fungicides"]
[{"$f":"IF(B10=\"\",\"\",LEFT(A9,7)&TEXT(RIGHT(A9,3)+1,\"000\"))","v":"SS_FNG-002"},"AzTeb Select™","1 Gallon","Alternative for: Unique Formulation",435.05,"Gallon",null,"Fungicides"]
["SS_FNG-003","Chlorothalonil 720 Select™","2x2.5","Alternative for: Daconil Weatherstik®",47.75,"Gallon",null,"Fungicides"]
["SS_FNG-004","Chlorothalonil 82.5DF Select™","4x5","Alternative for: Daconil Ultrex®",8.75,"LB",null,"Fungicides"]
["SS_FNG-005","Echo ZN","2x2.5","Alternative for: Daconil® ZN",45.95,"Gallon",null,"Fungicides"]
["SS_FNG-006","Fosal Select™","11 #","Alternative for: Chipco Signature®",16.5,"LB",null,"Fungicides"]
["SS_FNG-007","Iprodione 2F Select™","2x2.5","Alternative for: Chipco 26019®",48,"Gallon",null,"Fungicides"]
["SS_FNG-008","Manzate Max T&O","2x2.5","Alternative for: Dithane®",43.85,"Gallon",null,"Fungicides"]
["SS_FNG-009","Manzate Pro-Stick T&O","48 #","Alternative for: Dithane®",5.8,"LB",null,"Fungicides"]
["SS_FNG-010","PPZ 41.8 Select™","1 Gallon","Alternative for: Spectator™",125,"Gallon",null,"Fungicides"]
["SS_FNG-011","Propiconazole 14.3 Select™","2x2.5","Alternative for: Banner Maxx®",62.5,"Gallon",null,"Fungicides"]
["SS_FNG-012","Proplant","1 Gallon","Alternative for: Banol®",396.10389610389609,"Gallon",null,"Fungicides"]
{"$rows_left_out":57}